{"text_format":"1","workbook":"xlsx","n_sheets":9,"sheets":["Menu","Cad","Colab","Treinamentos","Plano","Dash1","Tab","CST","FS"],"not_rendered":{"charts":4,"images":37,"macros":1,"external_links":3,"defined_names":17,"comments":0,"pivot_tables":6},"unopened":[],"bounds":{"document_bytes":16777216,"sheet_cells":100000,"rows_first":2000,"rows_last":500,"rows_between":2000,"halvings":0,"cell_chars":16384,"cell_head_chars":4096},"cells_cut":0,"cells_raw":0,"read":"whole","date_system":"1900"}

{"sheet":"Menu","index":0,"n_rows":15,"n_cols":11,"rows_kept":15,"cut":false,"hidden":false,"merged":[[13,8,13,9],[13,10,13,15],[14,10,14,15],[14,7,14,9]]}
[]
[]
[]
[]
[]
[]
[]
[]
[]
[]
[]
[]
[]
[null,null,null,null,null,null,null,null,"Empresa",null,"Empresa ABCDE"]
[null,null,null,null,null,null,null,"Segmento da Empresa",null,null,"Comércio"]

{"sheet":"Cad","index":1,"n_rows":33,"n_cols":12,"rows_kept":33,"cut":false,"hidden":false,"merged":[[10,1,10,2],[10,4,10,5],[11,1,12,1],[11,2,12,2],[11,4,12,4],[11,5,12,5]]}
[]
[]
[]
[]
[]
[]
[]
[]
[]
[]
[null,"CADASTRO DE FUNÇÕES\nINSIRA AS FUNÇÕES UTILIZADAS EM SUA EMPRESA",null,null,"CADASTRO DE DEPARTAMENTOS\nINSIRA OS DEPARTAMENTOS UTILIZADOS EM SUA EMPRESA"]
[null,"ITEM","FUNÇÃO",null,"ITEM","DEPARTAMENTO"]
[null,null,null,null,null,null,null,"Programado","Programado",null,"Concluído","Concluído"]
[null,1,"Auxiliar Administrativo",null,1,"Administrativo",null,{"$f":"COUNTIFS(Plano!$C$13:$C$300,F14,Plano!$M$13:$M$300,$H$13)","v":0},{"$f":"SUMIFS(Plano!$L$13:$L$300,Plano!$C$13:$C$300,C14,Plano!$M$13:$M$300,$I$13)","v":0},null,{"$f":"COUNTIFS(Plano!$C$13:$C$300,F14,Plano!$M$13:$M$300,$K$13)","v":1},{"$f":"SUMIFS(Plano!$L$13:$L$300,Plano!$C$13:$C$300,F14,Plano!$M$13:$M$300,$L$13)","v":2000}]
[null,2,"Analista Administrativo",null,2,"Produção",null,{"$f":"COUNTIFS(Plano!$C$13:$C$300,F15,Plano!$M$13:$M$300,$H$13)","v":1},{"$f":"SUMIFS(Plano!$L$13:$L$300,Plano!$C$13:$C$300,C15,Plano!$M$13:$M$300,$I$13)","v":0},null,{"$f":"COUNTIFS(Plano!$C$13:$C$300,F15,Plano!$M$13:$M$300,$K$13)","v":0},{"$f":"SUMIFS(Plano!$L$13:$L$300,Plano!$C$13:$C$300,F15,Plano!$M$13:$M$300,$L$13)","v":0}]
[null,3,"Recepcionista",null,3,null,null,{"$f":"COUNTIFS(Plano!$C$13:$C$300,F16,Plano!$M$13:$M$300,$H$13)","v":0},{"$f":"SUMIFS(Plano!$L$13:$L$300,Plano!$C$13:$C$300,C16,Plano!$M$13:$M$300,$I$13)","v":0},null,{"$f":"COUNTIFS(Plano!$C$13:$C$300,F16,Plano!$M$13:$M$300,$K$13)","v":0},{"$f":"SUMIFS(Plano!$L$13:$L$300,Plano!$C$13:$C$300,F16,Plano!$M$13:$M$300,$L$13)","v":0}]
[null,4,"Gerente Geral",null,4,null,null,{"$f":"COUNTIFS(Plano!$C$13:$C$300,F17,Plano!$M$13:$M$300,$H$13)","v":0},{"$f":"SUMIFS(Plano!$L$13:$L$300,Plano!$C$13:$C$300,C17,Plano!$M$13:$M$300,$I$13)","v":0},null,{"$f":"COUNTIFS(Plano!$C$13:$C$300,F17,Plano!$M$13:$M$300,$K$13)","v":0},{"$f":"SUMIFS(Plano!$L$13:$L$300,Plano!$C$13:$C$300,F17,Plano!$M$13:$M$300,$L$13)","v":0}]
[null,5,"Auxiliar de Produção",null,5,null,null,{"$f":"COUNTIFS(Plano!$C$13:$C$300,F18,Plano!$M$13:$M$300,$H$13)","v":0},{"$f":"SUMIFS(Plano!$L$13:$L$300,Plano!$C$13:$C$300,C18,Plano!$M$13:$M$300,$I$13)","v":0},null,{"$f":"COUNTIFS(Plano!$C$13:$C$300,F18,Plano!$M$13:$M$300,$K$13)","v":0},{"$f":"SUMIFS(Plano!$L$13:$L$300,Plano!$C$13:$C$300,F18,Plano!$M$13:$M$300,$L$13)","v":0}]
[null,6,null,null,6,null,null,{"$f":"COUNTIFS(Plano!$C$13:$C$300,F19,Plano!$M$13:$M$300,$H$13)","v":0},{"$f":"SUMIFS(Plano!$L$13:$L$300,Plano!$C$13:$C$300,C19,Plano!$M$13:$M$300,$I$13)","v":0},null,{"$f":"COUNTIFS(Plano!$C$13:$C$300,F19,Plano!$M$13:$M$300,$K$13)","v":0},{"$f":"SUMIFS(Plano!$L$13:$L$300,Plano!$C$13:$C$300,F19,Plano!$M$13:$M$300,$L$13)","v":0}]
[null,7,null,null,7,null,null,{"$f":"COUNTIFS(Plano!$C$13:$C$300,F20,Plano!$M$13:$M$300,$H$13)","v":0},{"$f":"SUMIFS(Plano!$L$13:$L$300,Plano!$C$13:$C$300,C20,Plano!$M$13:$M$300,$I$13)","v":0},null,{"$f":"COUNTIFS(Plano!$C$13:$C$300,F20,Plano!$M$13:$M$300,$K$13)","v":0},{"$f":"SUMIFS(Plano!$L$13:$L$300,Plano!$C$13:$C$300,F20,Plano!$M$13:$M$300,$L$13)","v":0}]
[null,8,null,null,8,null,null,{"$f":"COUNTIFS(Plano!$C$13:$C$300,F21,Plano!$M$13:$M$300,$H$13)","v":0},{"$f":"SUMIFS(Plano!$L$13:$L$300,Plano!$C$13:$C$300,C21,Plano!$M$13:$M$300,$I$13)","v":0},null,{"$f":"COUNTIFS(Plano!$C$13:$C$300,F21,Plano!$M$13:$M$300,$K$13)","v":0},{"$f":"SUMIFS(Plano!$L$13:$L$300,Plano!$C$13:$C$300,F21,Plano!$M$13:$M$300,$L$13)","v":0}]
[null,9,null,null,9,null,null,{"$f":"COUNTIFS(Plano!$C$13:$C$300,F22,Plano!$M$13:$M$300,$H$13)","v":0},{"$f":"SUMIFS(Plano!$L$13:$L$300,Plano!$C$13:$C$300,C22,Plano!$M$13:$M$300,$I$13)","v":0},null,{"$f":"COUNTIFS(Plano!$C$13:$C$300,F22,Plano!$M$13:$M$300,$K$13)","v":0},{"$f":"SUMIFS(Plano!$L$13:$L$300,Plano!$C$13:$C$300,F22,Plano!$M$13:$M$300,$L$13)","v":0}]
[null,10,null,null,10,null,null,{"$f":"COUNTIFS(Plano!$C$13:$C$300,F23,Plano!$M$13:$M$300,$H$13)","v":0},{"$f":"SUMIFS(Plano!$L$13:$L$300,Plano!$C$13:$C$300,C23,Plano!$M$13:$M$300,$I$13)","v":0},null,{"$f":"COUNTIFS(Plano!$C$13:$C$300,F23,Plano!$M$13:$M$300,$K$13)","v":0},{"$f":"SUMIFS(Plano!$L$13:$L$300,Plano!$C$13:$C$300,F23,Plano!$M$13:$M$300,$L$13)","v":0}]
[null,11,null,null,11,null,null,{"$f":"COUNTIFS(Plano!$C$13:$C$300,F24,Plano!$M$13:$M$300,$H$13)","v":0},{"$f":"SUMIFS(Plano!$L$13:$L$300,Plano!$C$13:$C$300,C24,Plano!$M$13:$M$300,$I$13)","v":0},null,{"$f":"COUNTIFS(Plano!$C$13:$C$300,F24,Plano!$M$13:$M$300,$K$13)","v":0},{"$f":"SUMIFS(Plano!$L$13:$L$300,Plano!$C$13:$C$300,F24,Plano!$M$13:$M$300,$L$13)","v":0}]
[null,12,null,null,12,null,null,{"$f":"COUNTIFS(Plano!$C$13:$C$300,F25,Plano!$M$13:$M$300,$H$13)","v":0},{"$f":"SUMIFS(Plano!$L$13:$L$300,Plano!$C$13:$C$300,C25,Plano!$M$13:$M$300,$I$13)","v":0},null,{"$f":"COUNTIFS(Plano!$C$13:$C$300,F25,Plano!$M$13:$M$300,$K$13)","v":0},{"$f":"SUMIFS(Plano!$L$13:$L$300,Plano!$C$13:$C$300,F25,Plano!$M$13:$M$300,$L$13)","v":0}]
[null,13,null,null,13,null,null,{"$f":"COUNTIFS(Plano!$C$13:$C$300,F26,Plano!$M$13:$M$300,$H$13)","v":0},{"$f":"SUMIFS(Plano!$L$13:$L$300,Plano!$C$13:$C$300,C26,Plano!$M$13:$M$300,$I$13)","v":0},null,{"$f":"COUNTIFS(Plano!$C$13:$C$300,F26,Plano!$M$13:$M$300,$K$13)","v":0},{"$f":"SUMIFS(Plano!$L$13:$L$300,Plano!$C$13:$C$300,F26,Plano!$M$13:$M$300,$L$13)","v":0}]
[null,14,null,null,14,null,null,{"$f":"COUNTIFS(Plano!$C$13:$C$300,F27,Plano!$M$13:$M$300,$H$13)","v":0},{"$f":"SUMIFS(Plano!$L$13:$L$300,Plano!$C$13:$C$300,C27,Plano!$M$13:$M$300,$I$13)","v":0},null,{"$f":"COUNTIFS(Plano!$C$13:$C$300,F27,Plano!$M$13:$M$300,$K$13)","v":0},{"$f":"SUMIFS(Plano!$L$13:$L$300,Plano!$C$13:$C$300,F27,Plano!$M$13:$M$300,$L$13)","v":0}]
[null,15,null,null,15,null,null,{"$f":"COUNTIFS(Plano!$C$13:$C$300,F28,Plano!$M$13:$M$300,$H$13)","v":0},{"$f":"SUMIFS(Plano!$L$13:$L$300,Plano!$C$13:$C$300,C28,Plano!$M$13:$M$300,$I$13)","v":0},null,{"$f":"COUNTIFS(Plano!$C$13:$C$300,F28,Plano!$M$13:$M$300,$K$13)","v":0},{"$f":"SUMIFS(Plano!$L$13:$L$300,Plano!$C$13:$C$300,F28,Plano!$M$13:$M$300,$L$13)","v":0}]
[null,16,null,null,16,null,null,{"$f":"COUNTIFS(Plano!$C$13:$C$300,F29,Plano!$M$13:$M$300,$H$13)","v":0},{"$f":"SUMIFS(Plano!$L$13:$L$300,Plano!$C$13:$C$300,C29,Plano!$M$13:$M$300,$I$13)","v":0},null,{"$f":"COUNTIFS(Plano!$C$13:$C$300,F29,Plano!$M$13:$M$300,$K$13)","v":0},{"$f":"SUMIFS(Plano!$L$13:$L$300,Plano!$C$13:$C$300,F29,Plano!$M$13:$M$300,$L$13)","v":0}]
[null,17,null,null,17,null,null,{"$f":"COUNTIFS(Plano!$C$13:$C$300,F30,Plano!$M$13:$M$300,$H$13)","v":0},{"$f":"SUMIFS(Plano!$L$13:$L$300,Plano!$C$13:$C$300,C30,Plano!$M$13:$M$300,$I$13)","v":0},null,{"$f":"COUNTIFS(Plano!$C$13:$C$300,F30,Plano!$M$13:$M$300,$K$13)","v":0},{"$f":"SUMIFS(Plano!$L$13:$L$300,Plano!$C$13:$C$300,F30,Plano!$M$13:$M$300,$L$13)","v":0}]
[null,18,null,null,18,null,null,{"$f":"COUNTIFS(Plano!$C$13:$C$300,F31,Plano!$M$13:$M$300,$H$13)","v":0},{"$f":"SUMIFS(Plano!$L$13:$L$300,Plano!$C$13:$C$300,C31,Plano!$M$13:$M$300,$I$13)","v":0},null,{"$f":"COUNTIFS(Plano!$C$13:$C$300,F31,Plano!$M$13:$M$300,$K$13)","v":0},{"$f":"SUMIFS(Plano!$L$13:$L$300,Plano!$C$13:$C$300,F31,Plano!$M$13:$M$300,$L$13)","v":0}]
[null,19,null,null,19,null,null,{"$f":"COUNTIFS(Plano!$C$13:$C$300,F32,Plano!$M$13:$M$300,$H$13)","v":0},{"$f":"SUMIFS(Plano!$L$13:$L$300,Plano!$C$13:$C$300,C32,Plano!$M$13:$M$300,$I$13)","v":0},null,{"$f":"COUNTIFS(Plano!$C$13:$C$300,F32,Plano!$M$13:$M$300,$K$13)","v":0},{"$f":"SUMIFS(Plano!$L$13:$L$300,Plano!$C$13:$C$300,F32,Plano!$M$13:$M$300,$L$13)","v":0}]
[null,20,null,null,20,null,null,{"$f":"COUNTIFS(Plano!$C$13:$C$300,F33,Plano!$M$13:$M$300,$H$13)","v":0},{"$f":"SUMIFS(Plano!$L$13:$L$300,Plano!$C$13:$C$300,C33,Plano!$M$13:$M$300,$I$13)","v":0},null,{"$f":"COUNTIFS(Plano!$C$13:$C$300,F33,Plano!$M$13:$M$300,$K$13)","v":0},{"$f":"SUMIFS(Plano!$L$13:$L$300,Plano!$C$13:$C$300,F33,Plano!$M$13:$M$300,$L$13)","v":0}]

{"sheet":"Colab","index":2,"n_rows":63,"n_cols":15,"rows_kept":63,"cut":false,"hidden":false,"merged":[[9,3,9,4],[11,2,11,4]]}
[]
[]
[]
[]
[]
[]
[]
[]
[]
[]
[]
[null,null,"CADASTRO DE COLABORADORES\nINSIRA OS DADOS DOS SEUS COLABORADORES"]
[null,null,"COLABORADOR","DEPARTAMENTO","FUNÇÃO",null,null,null,null,null,"Programado","Programado",null,"Concluído","Concluído"]
[null,null,"José da Silva","Administrativo","Assistente Administrativo",null,null,null,null,null,{"$f":"COUNTIFS(Plano!$B$13:$B$999,C14,Plano!$M$13:$M$999,$K$13)","v":0},{"$f":"SUMIFS(Plano!$L$13:$L$999,Plano!$B$13:$B$999,C14,Plano!$M$13:$M$999,$L$13)","v":0},null,{"$f":"COUNTIFS(Plano!$B$13:$B$999,C14,Plano!$M$13:$M$999,$N$13)","v":1},{"$f":"SUMIFS(Plano!$L$13:$L$999,Plano!$B$13:$B$999,C14,Plano!$M$13:$M$999,$O$13)","v":2000}]
[null,null,"João Alves","Produção","Auxiliar de Produção",null,null,null,null,null,{"$f":"COUNTIFS(Plano!$B$13:$B$999,C15,Plano!$M$13:$M$999,$K$13)","v":1},{"$f":"SUMIFS(Plano!$L$13:$L$999,Plano!$B$13:$B$999,C15,Plano!$M$13:$M$999,$L$13)","v":500},null,{"$f":"COUNTIFS(Plano!$B$13:$B$999,C15,Plano!$M$13:$M$999,$N$13)","v":0},{"$f":"SUMIFS(Plano!$L$13:$L$999,Plano!$B$13:$B$999,C15,Plano!$M$13:$M$999,$O$13)","v":0}]
[null,null,"Paulo Vitor","Administrativo","Analista Administrativo",null,null,null,null,null,{"$f":"COUNTIFS(Plano!$B$13:$B$999,C16,Plano!$M$13:$M$999,$K$13)","v":0},{"$f":"SUMIFS(Plano!$L$13:$L$999,Plano!$B$13:$B$999,C16,Plano!$M$13:$M$999,$L$13)","v":0},null,{"$f":"COUNTIFS(Plano!$B$13:$B$999,C16,Plano!$M$13:$M$999,$N$13)","v":0},{"$f":"SUMIFS(Plano!$L$13:$L$999,Plano!$B$13:$B$999,C16,Plano!$M$13:$M$999,$O$13)","v":0}]
[null,null,null,null,null,null,null,null,null,null,{"$f":"COUNTIFS(Plano!$B$13:$B$999,C17,Plano!$M$13:$M$999,$K$13)","v":0},{"$f":"SUMIFS(Plano!$L$13:$L$999,Plano!$B$13:$B$999,C17,Plano!$M$13:$M$999,$L$13)","v":0},null,{"$f":"COUNTIFS(Plano!$B$13:$B$999,C17,Plano!$M$13:$M$999,$N$13)","v":0},{"$f":"SUMIFS(Plano!$L$13:$L$999,Plano!$B$13:$B$999,C17,Plano!$M$13:$M$999,$O$13)","v":0}]
[null,null,null,null,null,null,null,null,null,null,{"$f":"COUNTIFS(Plano!$B$13:$B$999,C18,Plano!$M$13:$M$999,$K$13)","v":0},{"$f":"SUMIFS(Plano!$L$13:$L$999,Plano!$B$13:$B$999,C18,Plano!$M$13:$M$999,$L$13)","v":0},null,{"$f":"COUNTIFS(Plano!$B$13:$B$999,C18,Plano!$M$13:$M$999,$N$13)","v":0},{"$f":"SUMIFS(Plano!$L$13:$L$999,Plano!$B$13:$B$999,C18,Plano!$M$13:$M$999,$O$13)","v":0}]
[null,null,null,null,null,null,null,null,null,null,{"$f":"COUNTIFS(Plano!$B$13:$B$999,C19,Plano!$M$13:$M$999,$K$13)","v":0},{"$f":"SUMIFS(Plano!$L$13:$L$999,Plano!$B$13:$B$999,C19,Plano!$M$13:$M$999,$L$13)","v":0},null,{"$f":"COUNTIFS(Plano!$B$13:$B$999,C19,Plano!$M$13:$M$999,$N$13)","v":0},{"$f":"SUMIFS(Plano!$L$13:$L$999,Plano!$B$13:$B$999,C19,Plano!$M$13:$M$999,$O$13)","v":0}]
[null,null,null,null,null,null,null,null,null,null,{"$f":"COUNTIFS(Plano!$B$13:$B$999,C20,Plano!$M$13:$M$999,$K$13)","v":0},{"$f":"SUMIFS(Plano!$L$13:$L$999,Plano!$B$13:$B$999,C20,Plano!$M$13:$M$999,$L$13)","v":0},null,{"$f":"COUNTIFS(Plano!$B$13:$B$999,C20,Plano!$M$13:$M$999,$N$13)","v":0},{"$f":"SUMIFS(Plano!$L$13:$L$999,Plano!$B$13:$B$999,C20,Plano!$M$13:$M$999,$O$13)","v":0}]
[null,null,null,null,null,null,null,null,null,null,{"$f":"COUNTIFS(Plano!$B$13:$B$999,C21,Plano!$M$13:$M$999,$K$13)","v":0},{"$f":"SUMIFS(Plano!$L$13:$L$999,Plano!$B$13:$B$999,C21,Plano!$M$13:$M$999,$L$13)","v":0},null,{"$f":"COUNTIFS(Plano!$B$13:$B$999,C21,Plano!$M$13:$M$999,$N$13)","v":0},{"$f":"SUMIFS(Plano!$L$13:$L$999,Plano!$B$13:$B$999,C21,Plano!$M$13:$M$999,$O$13)","v":0}]
[null,null,null,null,null,null,null,null,null,null,{"$f":"COUNTIFS(Plano!$B$13:$B$999,C22,Plano!$M$13:$M$999,$K$13)","v":0},{"$f":"SUMIFS(Plano!$L$13:$L$999,Plano!$B$13:$B$999,C22,Plano!$M$13:$M$999,$L$13)","v":0},null,{"$f":"COUNTIFS(Plano!$B$13:$B$999,C22,Plano!$M$13:$M$999,$N$13)","v":0},{"$f":"SUMIFS(Plano!$L$13:$L$999,Plano!$B$13:$B$999,C22,Plano!$M$13:$M$999,$O$13)","v":0}]
[null,null,null,null,null,null,null,null,null,null,{"$f":"COUNTIFS(Plano!$B$13:$B$999,C23,Plano!$M$13:$M$999,$K$13)","v":0},{"$f":"SUMIFS(Plano!$L$13:$L$999,Plano!$B$13:$B$999,C23,Plano!$M$13:$M$999,$L$13)","v":0},null,{"$f":"COUNTIFS(Plano!$B$13:$B$999,C23,Plano!$M$13:$M$999,$N$13)","v":0},{"$f":"SUMIFS(Plano!$L$13:$L$999,Plano!$B$13:$B$999,C23,Plano!$M$13:$M$999,$O$13)","v":0}]
[null,null,null,null,null,null,null,null,null,null,{"$f":"COUNTIFS(Plano!$B$13:$B$999,C24,Plano!$M$13:$M$999,$K$13)","v":0},{"$f":"SUMIFS(Plano!$L$13:$L$999,Plano!$B$13:$B$999,C24,Plano!$M$13:$M$999,$L$13)","v":0},null,{"$f":"COUNTIFS(Plano!$B$13:$B$999,C24,Plano!$M$13:$M$999,$N$13)","v":0},{"$f":"SUMIFS(Plano!$L$13:$L$999,Plano!$B$13:$B$999,C24,Plano!$M$13:$M$999,$O$13)","v":0}]
[null,null,null,null,null,null,null,null,null,null,{"$f":"COUNTIFS(Plano!$B$13:$B$999,C25,Plano!$M$13:$M$999,$K$13)","v":0},{"$f":"SUMIFS(Plano!$L$13:$L$999,Plano!$B$13:$B$999,C25,Plano!$M$13:$M$999,$L$13)","v":0},null,{"$f":"COUNTIFS(Plano!$B$13:$B$999,C25,Plano!$M$13:$M$999,$N$13)","v":0},{"$f":"SUMIFS(Plano!$L$13:$L$999,Plano!$B$13:$B$999,C25,Plano!$M$13:$M$999,$O$13)","v":0}]
[null,null,null,null,null,null,null,null,null,null,{"$f":"COUNTIFS(Plano!$B$13:$B$999,C26,Plano!$M$13:$M$999,$K$13)","v":0},{"$f":"SUMIFS(Plano!$L$13:$L$999,Plano!$B$13:$B$999,C26,Plano!$M$13:$M$999,$L$13)","v":0},null,{"$f":"COUNTIFS(Plano!$B$13:$B$999,C26,Plano!$M$13:$M$999,$N$13)","v":0},{"$f":"SUMIFS(Plano!$L$13:$L$999,Plano!$B$13:$B$999,C26,Plano!$M$13:$M$999,$O$13)","v":0}]
[null,null,null,null,null,null,null,null,null,null,{"$f":"COUNTIFS(Plano!$B$13:$B$999,C27,Plano!$M$13:$M$999,$K$13)","v":0},{"$f":"SUMIFS(Plano!$L$13:$L$999,Plano!$B$13:$B$999,C27,Plano!$M$13:$M$999,$L$13)","v":0},null,{"$f":"COUNTIFS(Plano!$B$13:$B$999,C27,Plano!$M$13:$M$999,$N$13)","v":0},{"$f":"SUMIFS(Plano!$L$13:$L$999,Plano!$B$13:$B$999,C27,Plano!$M$13:$M$999,$O$13)","v":0}]
[null,null,null,null,null,null,null,null,null,null,{"$f":"COUNTIFS(Plano!$B$13:$B$999,C28,Plano!$M$13:$M$999,$K$13)","v":0},{"$f":"SUMIFS(Plano!$L$13:$L$999,Plano!$B$13:$B$999,C28,Plano!$M$13:$M$999,$L$13)","v":0},null,{"$f":"COUNTIFS(Plano!$B$13:$B$999,C28,Plano!$M$13:$M$999,$N$13)","v":0},{"$f":"SUMIFS(Plano!$L$13:$L$999,Plano!$B$13:$B$999,C28,Plano!$M$13:$M$999,$O$13)","v":0}]
[null,null,null,null,null,null,null,null,null,null,{"$f":"COUNTIFS(Plano!$B$13:$B$999,C29,Plano!$M$13:$M$999,$K$13)","v":0},{"$f":"SUMIFS(Plano!$L$13:$L$999,Plano!$B$13:$B$999,C29,Plano!$M$13:$M$999,$L$13)","v":0},null,{"$f":"COUNTIFS(Plano!$B$13:$B$999,C29,Plano!$M$13:$M$999,$N$13)","v":0},{"$f":"SUMIFS(Plano!$L$13:$L$999,Plano!$B$13:$B$999,C29,Plano!$M$13:$M$999,$O$13)","v":0}]
[null,null,null,null,null,null,null,null,null,null,{"$f":"COUNTIFS(Plano!$B$13:$B$999,C30,Plano!$M$13:$M$999,$K$13)","v":0},{"$f":"SUMIFS(Plano!$L$13:$L$999,Plano!$B$13:$B$999,C30,Plano!$M$13:$M$999,$L$13)","v":0},null,{"$f":"COUNTIFS(Plano!$B$13:$B$999,C30,Plano!$M$13:$M$999,$N$13)","v":0},{"$f":"SUMIFS(Plano!$L$13:$L$999,Plano!$B$13:$B$999,C30,Plano!$M$13:$M$999,$O$13)","v":0}]
[null,null,null,null,null,null,null,null,null,null,{"$f":"COUNTIFS(Plano!$B$13:$B$999,C31,Plano!$M$13:$M$999,$K$13)","v":0},{"$f":"SUMIFS(Plano!$L$13:$L$999,Plano!$B$13:$B$999,C31,Plano!$M$13:$M$999,$L$13)","v":0},null,{"$f":"COUNTIFS(Plano!$B$13:$B$999,C31,Plano!$M$13:$M$999,$N$13)","v":0},{"$f":"SUMIFS(Plano!$L$13:$L$999,Plano!$B$13:$B$999,C31,Plano!$M$13:$M$999,$O$13)","v":0}]
[null,null,null,null,null,null,null,null,null,null,{"$f":"COUNTIFS(Plano!$B$13:$B$999,C32,Plano!$M$13:$M$999,$K$13)","v":0},{"$f":"SUMIFS(Plano!$L$13:$L$999,Plano!$B$13:$B$999,C32,Plano!$M$13:$M$999,$L$13)","v":0},null,{"$f":"COUNTIFS(Plano!$B$13:$B$999,C32,Plano!$M$13:$M$999,$N$13)","v":0},{"$f":"SUMIFS(Plano!$L$13:$L$999,Plano!$B$13:$B$999,C32,Plano!$M$13:$M$999,$O$13)","v":0}]
[null,null,null,null,null,null,null,null,null,null,{"$f":"COUNTIFS(Plano!$B$13:$B$999,C33,Plano!$M$13:$M$999,$K$13)","v":0},{"$f":"SUMIFS(Plano!$L$13:$L$999,Plano!$B$13:$B$999,C33,Plano!$M$13:$M$999,$L$13)","v":0},null,{"$f":"COUNTIFS(Plano!$B$13:$B$999,C33,Plano!$M$13:$M$999,$N$13)","v":0},{"$f":"SUMIFS(Plano!$L$13:$L$999,Plano!$B$13:$B$999,C33,Plano!$M$13:$M$999,$O$13)","v":0}]
[null,null,null,null,null,null,null,null,null,null,{"$f":"COUNTIFS(Plano!$B$13:$B$999,C34,Plano!$M$13:$M$999,$K$13)","v":0},{"$f":"SUMIFS(Plano!$L$13:$L$999,Plano!$B$13:$B$999,C34,Plano!$M$13:$M$999,$L$13)","v":0},null,{"$f":"COUNTIFS(Plano!$B$13:$B$999,C34,Plano!$M$13:$M$999,$N$13)","v":0},{"$f":"SUMIFS(Plano!$L$13:$L$999,Plano!$B$13:$B$999,C34,Plano!$M$13:$M$999,$O$13)","v":0}]
[null,null,null,null,null,null,null,null,null,null,{"$f":"COUNTIFS(Plano!$B$13:$B$999,C35,Plano!$M$13:$M$999,$K$13)","v":0},{"$f":"SUMIFS(Plano!$L$13:$L$999,Plano!$B$13:$B$999,C35,Plano!$M$13:$M$999,$L$13)","v":0},null,{"$f":"COUNTIFS(Plano!$B$13:$B$999,C35,Plano!$M$13:$M$999,$N$13)","v":0},{"$f":"SUMIFS(Plano!$L$13:$L$999,Plano!$B$13:$B$999,C35,Plano!$M$13:$M$999,$O$13)","v":0}]
[null,null,null,null,null,null,null,null,null,null,{"$f":"COUNTIFS(Plano!$B$13:$B$999,C36,Plano!$M$13:$M$999,$K$13)","v":0},{"$f":"SUMIFS(Plano!$L$13:$L$999,Plano!$B$13:$B$999,C36,Plano!$M$13:$M$999,$L$13)","v":0},null,{"$f":"COUNTIFS(Plano!$B$13:$B$999,C36,Plano!$M$13:$M$999,$N$13)","v":0},{"$f":"SUMIFS(Plano!$L$13:$L$999,Plano!$B$13:$B$999,C36,Plano!$M$13:$M$999,$O$13)","v":0}]
[null,null,null,null,null,null,null,null,null,null,{"$f":"COUNTIFS(Plano!$B$13:$B$999,C37,Plano!$M$13:$M$999,$K$13)","v":0},{"$f":"SUMIFS(Plano!$L$13:$L$999,Plano!$B$13:$B$999,C37,Plano!$M$13:$M$999,$L$13)","v":0},null,{"$f":"COUNTIFS(Plano!$B$13:$B$999,C37,Plano!$M$13:$M$999,$N$13)","v":0},{"$f":"SUMIFS(Plano!$L$13:$L$999,Plano!$B$13:$B$999,C37,Plano!$M$13:$M$999,$O$13)","v":0}]
[null,null,null,null,null,null,null,null,null,null,{"$f":"COUNTIFS(Plano!$B$13:$B$999,C38,Plano!$M$13:$M$999,$K$13)","v":0},{"$f":"SUMIFS(Plano!$L$13:$L$999,Plano!$B$13:$B$999,C38,Plano!$M$13:$M$999,$L$13)","v":0},null,{"$f":"COUNTIFS(Plano!$B$13:$B$999,C38,Plano!$M$13:$M$999,$N$13)","v":0},{"$f":"SUMIFS(Plano!$L$13:$L$999,Plano!$B$13:$B$999,C38,Plano!$M$13:$M$999,$O$13)","v":0}]
[null,null,null,null,null,null,null,null,null,null,{"$f":"COUNTIFS(Plano!$B$13:$B$999,C39,Plano!$M$13:$M$999,$K$13)","v":0},{"$f":"SUMIFS(Plano!$L$13:$L$999,Plano!$B$13:$B$999,C39,Plano!$M$13:$M$999,$L$13)","v":0},null,{"$f":"COUNTIFS(Plano!$B$13:$B$999,C39,Plano!$M$13:$M$999,$N$13)","v":0},{"$f":"SUMIFS(Plano!$L$13:$L$999,Plano!$B$13:$B$999,C39,Plano!$M$13:$M$999,$O$13)","v":0}]
[null,null,null,null,null,null,null,null,null,null,{"$f":"COUNTIFS(Plano!$B$13:$B$999,C40,Plano!$M$13:$M$999,$K$13)","v":0},{"$f":"SUMIFS(Plano!$L$13:$L$999,Plano!$B$13:$B$999,C40,Plano!$M$13:$M$999,$L$13)","v":0},null,{"$f":"COUNTIFS(Plano!$B$13:$B$999,C40,Plano!$M$13:$M$999,$N$13)","v":0},{"$f":"SUMIFS(Plano!$L$13:$L$999,Plano!$B$13:$B$999,C40,Plano!$M$13:$M$999,$O$13)","v":0}]
[null,null,null,null,null,null,null,null,null,null,{"$f":"COUNTIFS(Plano!$B$13:$B$999,C41,Plano!$M$13:$M$999,$K$13)","v":0},{"$f":"SUMIFS(Plano!$L$13:$L$999,Plano!$B$13:$B$999,C41,Plano!$M$13:$M$999,$L$13)","v":0},null,{"$f":"COUNTIFS(Plano!$B$13:$B$999,C41,Plano!$M$13:$M$999,$N$13)","v":0},{"$f":"SUMIFS(Plano!$L$13:$L$999,Plano!$B$13:$B$999,C41,Plano!$M$13:$M$999,$O$13)","v":0}]
[null,null,null,null,null,null,null,null,null,null,{"$f":"COUNTIFS(Plano!$B$13:$B$999,C42,Plano!$M$13:$M$999,$K$13)","v":0},{"$f":"SUMIFS(Plano!$L$13:$L$999,Plano!$B$13:$B$999,C42,Plano!$M$13:$M$999,$L$13)","v":0},null,{"$f":"COUNTIFS(Plano!$B$13:$B$999,C42,Plano!$M$13:$M$999,$N$13)","v":0},{"$f":"SUMIFS(Plano!$L$13:$L$999,Plano!$B$13:$B$999,C42,Plano!$M$13:$M$999,$O$13)","v":0}]
[null,null,null,null,null,null,null,null,null,null,{"$f":"COUNTIFS(Plano!$B$13:$B$999,C43,Plano!$M$13:$M$999,$K$13)","v":0},{"$f":"SUMIFS(Plano!$L$13:$L$999,Plano!$B$13:$B$999,C43,Plano!$M$13:$M$999,$L$13)","v":0},null,{"$f":"COUNTIFS(Plano!$B$13:$B$999,C43,Plano!$M$13:$M$999,$N$13)","v":0},{"$f":"SUMIFS(Plano!$L$13:$L$999,Plano!$B$13:$B$999,C43,Plano!$M$13:$M$999,$O$13)","v":0}]
[null,null,null,null,null,null,null,null,null,null,{"$f":"COUNTIFS(Plano!$B$13:$B$999,C44,Plano!$M$13:$M$999,$K$13)","v":0},{"$f":"SUMIFS(Plano!$L$13:$L$999,Plano!$B$13:$B$999,C44,Plano!$M$13:$M$999,$L$13)","v":0},null,{"$f":"COUNTIFS(Plano!$B$13:$B$999,C44,Plano!$M$13:$M$999,$N$13)","v":0},{"$f":"SUMIFS(Plano!$L$13:$L$999,Plano!$B$13:$B$999,C44,Plano!$M$13:$M$999,$O$13)","v":0}]
[null,null,null,null,null,null,null,null,null,null,{"$f":"COUNTIFS(Plano!$B$13:$B$999,C45,Plano!$M$13:$M$999,$K$13)","v":0},{"$f":"SUMIFS(Plano!$L$13:$L$999,Plano!$B$13:$B$999,C45,Plano!$M$13:$M$999,$L$13)","v":0},null,{"$f":"COUNTIFS(Plano!$B$13:$B$999,C45,Plano!$M$13:$M$999,$N$13)","v":0},{"$f":"SUMIFS(Plano!$L$13:$L$999,Plano!$B$13:$B$999,C45,Plano!$M$13:$M$999,$O$13)","v":0}]
[null,null,null,null,null,null,null,null,null,null,{"$f":"COUNTIFS(Plano!$B$13:$B$999,C46,Plano!$M$13:$M$999,$K$13)","v":0},{"$f":"SUMIFS(Plano!$L$13:$L$999,Plano!$B$13:$B$999,C46,Plano!$M$13:$M$999,$L$13)","v":0},null,{"$f":"COUNTIFS(Plano!$B$13:$B$999,C46,Plano!$M$13:$M$999,$N$13)","v":0},{"$f":"SUMIFS(Plano!$L$13:$L$999,Plano!$B$13:$B$999,C46,Plano!$M$13:$M$999,$O$13)","v":0}]
[null,null,null,null,null,null,null,null,null,null,{"$f":"COUNTIFS(Plano!$B$13:$B$999,C47,Plano!$M$13:$M$999,$K$13)","v":0},{"$f":"SUMIFS(Plano!$L$13:$L$999,Plano!$B$13:$B$999,C47,Plano!$M$13:$M$999,$L$13)","v":0},null,{"$f":"COUNTIFS(Plano!$B$13:$B$999,C47,Plano!$M$13:$M$999,$N$13)","v":0},{"$f":"SUMIFS(Plano!$L$13:$L$999,Plano!$B$13:$B$999,C47,Plano!$M$13:$M$999,$O$13)","v":0}]
[null,null,null,null,null,null,null,null,null,null,{"$f":"COUNTIFS(Plano!$B$13:$B$999,C48,Plano!$M$13:$M$999,$K$13)","v":0},{"$f":"SUMIFS(Plano!$L$13:$L$999,Plano!$B$13:$B$999,C48,Plano!$M$13:$M$999,$L$13)","v":0},null,{"$f":"COUNTIFS(Plano!$B$13:$B$999,C48,Plano!$M$13:$M$999,$N$13)","v":0},{"$f":"SUMIFS(Plano!$L$13:$L$999,Plano!$B$13:$B$999,C48,Plano!$M$13:$M$999,$O$13)","v":0}]
[null,null,null,null,null,null,null,null,null,null,{"$f":"COUNTIFS(Plano!$B$13:$B$999,C49,Plano!$M$13:$M$999,$K$13)","v":0},{"$f":"SUMIFS(Plano!$L$13:$L$999,Plano!$B$13:$B$999,C49,Plano!$M$13:$M$999,$L$13)","v":0},null,{"$f":"COUNTIFS(Plano!$B$13:$B$999,C49,Plano!$M$13:$M$999,$N$13)","v":0},{"$f":"SUMIFS(Plano!$L$13:$L$999,Plano!$B$13:$B$999,C49,Plano!$M$13:$M$999,$O$13)","v":0}]
[null,null,null,null,null,null,null,null,null,null,{"$f":"COUNTIFS(Plano!$B$13:$B$999,C50,Plano!$M$13:$M$999,$K$13)","v":0},{"$f":"SUMIFS(Plano!$L$13:$L$999,Plano!$B$13:$B$999,C50,Plano!$M$13:$M$999,$L$13)","v":0},null,{"$f":"COUNTIFS(Plano!$B$13:$B$999,C50,Plano!$M$13:$M$999,$N$13)","v":0},{"$f":"SUMIFS(Plano!$L$13:$L$999,Plano!$B$13:$B$999,C50,Plano!$M$13:$M$999,$O$13)","v":0}]
[null,null,null,null,null,null,null,null,null,null,{"$f":"COUNTIFS(Plano!$B$13:$B$999,C51,Plano!$M$13:$M$999,$K$13)","v":0},{"$f":"SUMIFS(Plano!$L$13:$L$999,Plano!$B$13:$B$999,C51,Plano!$M$13:$M$999,$L$13)","v":0},null,{"$f":"COUNTIFS(Plano!$B$13:$B$999,C51,Plano!$M$13:$M$999,$N$13)","v":0},{"$f":"SUMIFS(Plano!$L$13:$L$999,Plano!$B$13:$B$999,C51,Plano!$M$13:$M$999,$O$13)","v":0}]
[null,null,null,null,null,null,null,null,null,null,{"$f":"COUNTIFS(Plano!$B$13:$B$999,C52,Plano!$M$13:$M$999,$K$13)","v":0},{"$f":"SUMIFS(Plano!$L$13:$L$999,Plano!$B$13:$B$999,C52,Plano!$M$13:$M$999,$L$13)","v":0},null,{"$f":"COUNTIFS(Plano!$B$13:$B$999,C52,Plano!$M$13:$M$999,$N$13)","v":0},{"$f":"SUMIFS(Plano!$L$13:$L$999,Plano!$B$13:$B$999,C52,Plano!$M$13:$M$999,$O$13)","v":0}]
[null,null,null,null,null,null,null,null,null,null,{"$f":"COUNTIFS(Plano!$B$13:$B$999,C53,Plano!$M$13:$M$999,$K$13)","v":0},{"$f":"SUMIFS(Plano!$L$13:$L$999,Plano!$B$13:$B$999,C53,Plano!$M$13:$M$999,$L$13)","v":0},null,{"$f":"COUNTIFS(Plano!$B$13:$B$999,C53,Plano!$M$13:$M$999,$N$13)","v":0},{"$f":"SUMIFS(Plano!$L$13:$L$999,Plano!$B$13:$B$999,C53,Plano!$M$13:$M$999,$O$13)","v":0}]
[null,null,null,null,null,null,null,null,null,null,{"$f":"COUNTIFS(Plano!$B$13:$B$999,C54,Plano!$M$13:$M$999,$K$13)","v":0},{"$f":"SUMIFS(Plano!$L$13:$L$999,Plano!$B$13:$B$999,C54,Plano!$M$13:$M$999,$L$13)","v":0},null,{"$f":"COUNTIFS(Plano!$B$13:$B$999,C54,Plano!$M$13:$M$999,$N$13)","v":0},{"$f":"SUMIFS(Plano!$L$13:$L$999,Plano!$B$13:$B$999,C54,Plano!$M$13:$M$999,$O$13)","v":0}]
[null,null,null,null,null,null,null,null,null,null,{"$f":"COUNTIFS(Plano!$B$13:$B$999,C55,Plano!$M$13:$M$999,$K$13)","v":0},{"$f":"SUMIFS(Plano!$L$13:$L$999,Plano!$B$13:$B$999,C55,Plano!$M$13:$M$999,$L$13)","v":0},null,{"$f":"COUNTIFS(Plano!$B$13:$B$999,C55,Plano!$M$13:$M$999,$N$13)","v":0},{"$f":"SUMIFS(Plano!$L$13:$L$999,Plano!$B$13:$B$999,C55,Plano!$M$13:$M$999,$O$13)","v":0}]
[null,null,null,null,null,null,null,null,null,null,{"$f":"COUNTIFS(Plano!$B$13:$B$999,C56,Plano!$M$13:$M$999,$K$13)","v":0},{"$f":"SUMIFS(Plano!$L$13:$L$999,Plano!$B$13:$B$999,C56,Plano!$M$13:$M$999,$L$13)","v":0},null,{"$f":"COUNTIFS(Plano!$B$13:$B$999,C56,Plano!$M$13:$M$999,$N$13)","v":0},{"$f":"SUMIFS(Plano!$L$13:$L$999,Plano!$B$13:$B$999,C56,Plano!$M$13:$M$999,$O$13)","v":0}]
[null,null,null,null,null,null,null,null,null,null,{"$f":"COUNTIFS(Plano!$B$13:$B$999,C57,Plano!$M$13:$M$999,$K$13)","v":0},{"$f":"SUMIFS(Plano!$L$13:$L$999,Plano!$B$13:$B$999,C57,Plano!$M$13:$M$999,$L$13)","v":0},null,{"$f":"COUNTIFS(Plano!$B$13:$B$999,C57,Plano!$M$13:$M$999,$N$13)","v":0},{"$f":"SUMIFS(Plano!$L$13:$L$999,Plano!$B$13:$B$999,C57,Plano!$M$13:$M$999,$O$13)","v":0}]
[null,null,null,null,null,null,null,null,null,null,{"$f":"COUNTIFS(Plano!$B$13:$B$999,C58,Plano!$M$13:$M$999,$K$13)","v":0},{"$f":"SUMIFS(Plano!$L$13:$L$999,Plano!$B$13:$B$999,C58,Plano!$M$13:$M$999,$L$13)","v":0},null,{"$f":"COUNTIFS(Plano!$B$13:$B$999,C58,Plano!$M$13:$M$999,$N$13)","v":0},{"$f":"SUMIFS(Plano!$L$13:$L$999,Plano!$B$13:$B$999,C58,Plano!$M$13:$M$999,$O$13)","v":0}]
[null,null,null,null,null,null,null,null,null,null,{"$f":"COUNTIFS(Plano!$B$13:$B$999,C59,Plano!$M$13:$M$999,$K$13)","v":0},{"$f":"SUMIFS(Plano!$L$13:$L$999,Plano!$B$13:$B$999,C59,Plano!$M$13:$M$999,$L$13)","v":0},null,{"$f":"COUNTIFS(Plano!$B$13:$B$999,C59,Plano!$M$13:$M$999,$N$13)","v":0},{"$f":"SUMIFS(Plano!$L$13:$L$999,Plano!$B$13:$B$999,C59,Plano!$M$13:$M$999,$O$13)","v":0}]
[null,null,null,null,null,null,null,null,null,null,{"$f":"COUNTIFS(Plano!$B$13:$B$999,C60,Plano!$M$13:$M$999,$K$13)","v":0},{"$f":"SUMIFS(Plano!$L$13:$L$999,Plano!$B$13:$B$999,C60,Plano!$M$13:$M$999,$L$13)","v":0},null,{"$f":"COUNTIFS(Plano!$B$13:$B$999,C60,Plano!$M$13:$M$999,$N$13)","v":0},{"$f":"SUMIFS(Plano!$L$13:$L$999,Plano!$B$13:$B$999,C60,Plano!$M$13:$M$999,$O$13)","v":0}]
[null,null,null,null,null,null,null,null,null,null,{"$f":"COUNTIFS(Plano!$B$13:$B$999,C61,Plano!$M$13:$M$999,$K$13)","v":0},{"$f":"SUMIFS(Plano!$L$13:$L$999,Plano!$B$13:$B$999,C61,Plano!$M$13:$M$999,$L$13)","v":0},null,{"$f":"COUNTIFS(Plano!$B$13:$B$999,C61,Plano!$M$13:$M$999,$N$13)","v":0},{"$f":"SUMIFS(Plano!$L$13:$L$999,Plano!$B$13:$B$999,C61,Plano!$M$13:$M$999,$O$13)","v":0}]
[null,null,null,null,null,null,null,null,null,null,{"$f":"COUNTIFS(Plano!$B$13:$B$999,C62,Plano!$M$13:$M$999,$K$13)","v":0},{"$f":"SUMIFS(Plano!$L$13:$L$999,Plano!$B$13:$B$999,C62,Plano!$M$13:$M$999,$L$13)","v":0},null,{"$f":"COUNTIFS(Plano!$B$13:$B$999,C62,Plano!$M$13:$M$999,$N$13)","v":0},{"$f":"SUMIFS(Plano!$L$13:$L$999,Plano!$B$13:$B$999,C62,Plano!$M$13:$M$999,$O$13)","v":0}]
[null,null,null,null,null,null,null,null,null,null,{"$f":"COUNTIFS(Plano!$B$13:$B$999,C63,Plano!$M$13:$M$999,$K$13)","v":0},{"$f":"SUMIFS(Plano!$L$13:$L$999,Plano!$B$13:$B$999,C63,Plano!$M$13:$M$999,$L$13)","v":0},null,{"$f":"COUNTIFS(Plano!$B$13:$B$999,C63,Plano!$M$13:$M$999,$N$13)","v":0},{"$f":"SUMIFS(Plano!$L$13:$L$999,Plano!$B$13:$B$999,C63,Plano!$M$13:$M$999,$O$13)","v":0}]

{"sheet":"Treinamentos","index":3,"n_rows":42,"n_cols":14,"rows_kept":42,"cut":false,"hidden":false,"merged":[[10,1,10,6]]}
[]
[]
[]
[]
[]
[]
[]
[]
[]
[]
[null,"CADASTRO DE TREINAMENTOS\nINSIRA OS TREINAMENTOS NECESSÁRIOS PARA SUA EMPRESA"]
[null,"TREINAMENTOS","NOME CAPACITAÇÃO","DESCRITIVO CAPACITAÇÃO","EMPRESA RESPONSÁVEL","CARGA HORÁRIA","VALOR POR ALUNO",null,null,"Programado","Programado",null,"Concluído","Concluído"]
[null,"Treinamento 1",null,null,null,"8 horas",2000,null,null,{"$f":"COUNTIFS([3]Plano!$E$14:$E$1000,[3]Treinamentos!B13,[3]Plano!$M$14:$M$1000,[3]Treinamentos!$M$13)","v":{"$error":"#VALUE!"}},{"$f":"SUMIFS([3]Plano!$L$14:$L$1000,[3]Plano!$E$14:$E$1000,[3]Treinamentos!B13,[3]Plano!$M$14:$M$1000,[3]Treinamentos!$N$13)","v":{"$error":"#VALUE!"}},null,{"$f":"COUNTIFS([3]Plano!$E$14:$E$1000,[3]Treinamentos!B13,[3]Plano!$M$14:$M$1000,[3]Treinamentos!$P$13)","v":{"$error":"#VALUE!"}},{"$f":"SUMIFS([3]Plano!$L$14:$L$1000,[3]Plano!$E$14:$E$1000,[3]Treinamentos!B13,[3]Plano!$M$14:$M$1000,[3]Treinamentos!$Q$13)","v":{"$error":"#VALUE!"}}]
[null,"Treinamento 2",null,null,null,"4 horas",500,null,null,{"$f":"COUNTIF([3]Plano!$E$14:$E$1000,[3]Treinamentos!B14)","v":{"$error":"#VALUE!"}},{"$f":"SUMIFS([3]Plano!$L$14:$L$1000,[3]Plano!$E$14:$E$1000,[3]Treinamentos!B14,[3]Plano!$M$14:$M$1000,[3]Treinamentos!$N$13)","v":{"$error":"#VALUE!"}},null,{"$f":"COUNTIFS([3]Plano!$E$14:$E$1000,[3]Treinamentos!B14,[3]Plano!$M$14:$M$1000,[3]Treinamentos!$P$13)","v":{"$error":"#VALUE!"}},{"$f":"SUMIFS([3]Plano!$L$14:$L$1000,[3]Plano!$E$14:$E$1000,[3]Treinamentos!B14,[3]Plano!$M$14:$M$1000,[3]Treinamentos!$Q$13)","v":{"$error":"#VALUE!"}}]
[null,"Treinamento 3",null,null,null,"2 horas",300,null,null,{"$f":"COUNTIF([3]Plano!$E$14:$E$1000,[3]Treinamentos!B15)","v":{"$error":"#VALUE!"}},{"$f":"SUMIFS([3]Plano!$L$14:$L$1000,[3]Plano!$E$14:$E$1000,[3]Treinamentos!B15,[3]Plano!$M$14:$M$1000,[3]Treinamentos!$N$13)","v":{"$error":"#VALUE!"}},null,{"$f":"COUNTIFS([3]Plano!$E$14:$E$1000,[3]Treinamentos!B15,[3]Plano!$M$14:$M$1000,[3]Treinamentos!$P$13)","v":{"$error":"#VALUE!"}},{"$f":"SUMIFS([3]Plano!$L$14:$L$1000,[3]Plano!$E$14:$E$1000,[3]Treinamentos!B15,[3]Plano!$M$14:$M$1000,[3]Treinamentos!$Q$13)","v":{"$error":"#VALUE!"}}]
[null,"Treinamento 4",null,null,null,"2 horas",300,null,null,{"$f":"COUNTIF([3]Plano!$E$14:$E$1000,[3]Treinamentos!B16)","v":{"$error":"#VALUE!"}},{"$f":"SUMIFS([3]Plano!$L$14:$L$1000,[3]Plano!$E$14:$E$1000,[3]Treinamentos!B16,[3]Plano!$M$14:$M$1000,[3]Treinamentos!$N$13)","v":{"$error":"#VALUE!"}},null,{"$f":"COUNTIFS([3]Plano!$E$14:$E$1000,[3]Treinamentos!B16,[3]Plano!$M$14:$M$1000,[3]Treinamentos!$P$13)","v":{"$error":"#VALUE!"}},{"$f":"SUMIFS([3]Plano!$L$14:$L$1000,[3]Plano!$E$14:$E$1000,[3]Treinamentos!B16,[3]Plano!$M$14:$M$1000,[3]Treinamentos!$Q$13)","v":{"$error":"#VALUE!"}}]
[null,"Treinamento 5",null,null,null,"2 horas",300,null,null,{"$f":"COUNTIF([3]Plano!$E$14:$E$1000,[3]Treinamentos!B17)","v":{"$error":"#VALUE!"}},{"$f":"SUMIFS([3]Plano!$L$14:$L$1000,[3]Plano!$E$14:$E$1000,[3]Treinamentos!B17,[3]Plano!$M$14:$M$1000,[3]Treinamentos!$N$13)","v":{"$error":"#VALUE!"}},null,{"$f":"COUNTIFS([3]Plano!$E$14:$E$1000,[3]Treinamentos!B17,[3]Plano!$M$14:$M$1000,[3]Treinamentos!$P$13)","v":{"$error":"#VALUE!"}},{"$f":"SUMIFS([3]Plano!$L$14:$L$1000,[3]Plano!$E$14:$E$1000,[3]Treinamentos!B17,[3]Plano!$M$14:$M$1000,[3]Treinamentos!$Q$13)","v":{"$error":"#VALUE!"}}]
[null,"Treinamento 6",null,null,null,"2 horas",300,null,null,{"$f":"COUNTIF([3]Plano!$E$14:$E$1000,[3]Treinamentos!B18)","v":{"$error":"#VALUE!"}},{"$f":"SUMIFS([3]Plano!$L$14:$L$1000,[3]Plano!$E$14:$E$1000,[3]Treinamentos!B18,[3]Plano!$M$14:$M$1000,[3]Treinamentos!$N$13)","v":{"$error":"#VALUE!"}},null,{"$f":"COUNTIFS([3]Plano!$E$14:$E$1000,[3]Treinamentos!B18,[3]Plano!$M$14:$M$1000,[3]Treinamentos!$P$13)","v":{"$error":"#VALUE!"}},{"$f":"SUMIFS([3]Plano!$L$14:$L$1000,[3]Plano!$E$14:$E$1000,[3]Treinamentos!B18,[3]Plano!$M$14:$M$1000,[3]Treinamentos!$Q$13)","v":{"$error":"#VALUE!"}}]
[null,"Treinamento 7",null,null,null,"2 horas",300,null,null,{"$f":"COUNTIF([3]Plano!$E$14:$E$1000,[3]Treinamentos!B19)","v":{"$error":"#VALUE!"}},{"$f":"SUMIFS([3]Plano!$L$14:$L$1000,[3]Plano!$E$14:$E$1000,[3]Treinamentos!B19,[3]Plano!$M$14:$M$1000,[3]Treinamentos!$N$13)","v":{"$error":"#VALUE!"}},null,{"$f":"COUNTIFS([3]Plano!$E$14:$E$1000,[3]Treinamentos!B19,[3]Plano!$M$14:$M$1000,[3]Treinamentos!$P$13)","v":{"$error":"#VALUE!"}},{"$f":"SUMIFS([3]Plano!$L$14:$L$1000,[3]Plano!$E$14:$E$1000,[3]Treinamentos!B19,[3]Plano!$M$14:$M$1000,[3]Treinamentos!$Q$13)","v":{"$error":"#VALUE!"}}]
[null,"Treinamento 8",null,null,null,"2 horas",300,null,null,{"$f":"COUNTIF([3]Plano!$E$14:$E$1000,[3]Treinamentos!B20)","v":{"$error":"#VALUE!"}},{"$f":"SUMIFS([3]Plano!$L$14:$L$1000,[3]Plano!$E$14:$E$1000,[3]Treinamentos!B20,[3]Plano!$M$14:$M$1000,[3]Treinamentos!$N$13)","v":{"$error":"#VALUE!"}},null,{"$f":"COUNTIFS([3]Plano!$E$14:$E$1000,[3]Treinamentos!B20,[3]Plano!$M$14:$M$1000,[3]Treinamentos!$P$13)","v":{"$error":"#VALUE!"}},{"$f":"SUMIFS([3]Plano!$L$14:$L$1000,[3]Plano!$E$14:$E$1000,[3]Treinamentos!B20,[3]Plano!$M$14:$M$1000,[3]Treinamentos!$Q$13)","v":{"$error":"#VALUE!"}}]
[null,"Treinamento 9",null,null,null,"2 horas",300,null,null,{"$f":"COUNTIF([3]Plano!$E$14:$E$1000,[3]Treinamentos!B21)","v":{"$error":"#VALUE!"}},{"$f":"SUMIFS([3]Plano!$L$14:$L$1000,[3]Plano!$E$14:$E$1000,[3]Treinamentos!B21,[3]Plano!$M$14:$M$1000,[3]Treinamentos!$N$13)","v":{"$error":"#VALUE!"}},null,{"$f":"COUNTIFS([3]Plano!$E$14:$E$1000,[3]Treinamentos!B21,[3]Plano!$M$14:$M$1000,[3]Treinamentos!$P$13)","v":{"$error":"#VALUE!"}},{"$f":"SUMIFS([3]Plano!$L$14:$L$1000,[3]Plano!$E$14:$E$1000,[3]Treinamentos!B21,[3]Plano!$M$14:$M$1000,[3]Treinamentos!$Q$13)","v":{"$error":"#VALUE!"}}]
[null,"Treinamento 10",null,null,null,"2 horas",300,null,null,{"$f":"COUNTIF([3]Plano!$E$14:$E$1000,[3]Treinamentos!B22)","v":{"$error":"#VALUE!"}},{"$f":"SUMIFS([3]Plano!$L$14:$L$1000,[3]Plano!$E$14:$E$1000,[3]Treinamentos!B22,[3]Plano!$M$14:$M$1000,[3]Treinamentos!$N$13)","v":{"$error":"#VALUE!"}},null,{"$f":"COUNTIFS([3]Plano!$E$14:$E$1000,[3]Treinamentos!B22,[3]Plano!$M$14:$M$1000,[3]Treinamentos!$P$13)","v":{"$error":"#VALUE!"}},{"$f":"SUMIFS([3]Plano!$L$14:$L$1000,[3]Plano!$E$14:$E$1000,[3]Treinamentos!B22,[3]Plano!$M$14:$M$1000,[3]Treinamentos!$Q$13)","v":{"$error":"#VALUE!"}}]
[null,"Treinamento 11",null,null,null,"2 horas",300,null,null,{"$f":"COUNTIF([3]Plano!$E$14:$E$1000,[3]Treinamentos!B23)","v":{"$error":"#VALUE!"}},{"$f":"SUMIFS([3]Plano!$L$14:$L$1000,[3]Plano!$E$14:$E$1000,[3]Treinamentos!B23,[3]Plano!$M$14:$M$1000,[3]Treinamentos!$N$13)","v":{"$error":"#VALUE!"}},null,{"$f":"COUNTIFS([3]Plano!$E$14:$E$1000,[3]Treinamentos!B23,[3]Plano!$M$14:$M$1000,[3]Treinamentos!$P$13)","v":{"$error":"#VALUE!"}},{"$f":"SUMIFS([3]Plano!$L$14:$L$1000,[3]Plano!$E$14:$E$1000,[3]Treinamentos!B23,[3]Plano!$M$14:$M$1000,[3]Treinamentos!$Q$13)","v":{"$error":"#VALUE!"}}]
[null,"Treinamento 12",null,null,null,"2 horas",300,null,null,{"$f":"COUNTIF([3]Plano!$E$14:$E$1000,[3]Treinamentos!B24)","v":{"$error":"#VALUE!"}},{"$f":"SUMIFS([3]Plano!$L$14:$L$1000,[3]Plano!$E$14:$E$1000,[3]Treinamentos!B24,[3]Plano!$M$14:$M$1000,[3]Treinamentos!$N$13)","v":{"$error":"#VALUE!"}},null,{"$f":"COUNTIFS([3]Plano!$E$14:$E$1000,[3]Treinamentos!B24,[3]Plano!$M$14:$M$1000,[3]Treinamentos!$P$13)","v":{"$error":"#VALUE!"}},{"$f":"SUMIFS([3]Plano!$L$14:$L$1000,[3]Plano!$E$14:$E$1000,[3]Treinamentos!B24,[3]Plano!$M$14:$M$1000,[3]Treinamentos!$Q$13)","v":{"$error":"#VALUE!"}}]
[null,"Treinamento 13",null,null,null,"2 horas",300,null,null,{"$f":"COUNTIF([3]Plano!$E$14:$E$1000,[3]Treinamentos!B25)","v":{"$error":"#VALUE!"}},{"$f":"SUMIFS([3]Plano!$L$14:$L$1000,[3]Plano!$E$14:$E$1000,[3]Treinamentos!B25,[3]Plano!$M$14:$M$1000,[3]Treinamentos!$N$13)","v":{"$error":"#VALUE!"}},null,{"$f":"COUNTIFS([3]Plano!$E$14:$E$1000,[3]Treinamentos!B25,[3]Plano!$M$14:$M$1000,[3]Treinamentos!$P$13)","v":{"$error":"#VALUE!"}},{"$f":"SUMIFS([3]Plano!$L$14:$L$1000,[3]Plano!$E$14:$E$1000,[3]Treinamentos!B25,[3]Plano!$M$14:$M$1000,[3]Treinamentos!$Q$13)","v":{"$error":"#VALUE!"}}]
[null,"Treinamento 14",null,null,null,"2 horas",300,null,null,{"$f":"COUNTIF([3]Plano!$E$14:$E$1000,[3]Treinamentos!B26)","v":{"$error":"#VALUE!"}},{"$f":"SUMIFS([3]Plano!$L$14:$L$1000,[3]Plano!$E$14:$E$1000,[3]Treinamentos!B26,[3]Plano!$M$14:$M$1000,[3]Treinamentos!$N$13)","v":{"$error":"#VALUE!"}},null,{"$f":"COUNTIFS([3]Plano!$E$14:$E$1000,[3]Treinamentos!B26,[3]Plano!$M$14:$M$1000,[3]Treinamentos!$P$13)","v":{"$error":"#VALUE!"}},{"$f":"SUMIFS([3]Plano!$L$14:$L$1000,[3]Plano!$E$14:$E$1000,[3]Treinamentos!B26,[3]Plano!$M$14:$M$1000,[3]Treinamentos!$Q$13)","v":{"$error":"#VALUE!"}}]
[null,"Treinamento 15",null,null,null,"2 horas",300,null,null,{"$f":"COUNTIF([3]Plano!$E$14:$E$1000,[3]Treinamentos!B27)","v":{"$error":"#VALUE!"}},{"$f":"SUMIFS([3]Plano!$L$14:$L$1000,[3]Plano!$E$14:$E$1000,[3]Treinamentos!B27,[3]Plano!$M$14:$M$1000,[3]Treinamentos!$N$13)","v":{"$error":"#VALUE!"}},null,{"$f":"COUNTIFS([3]Plano!$E$14:$E$1000,[3]Treinamentos!B27,[3]Plano!$M$14:$M$1000,[3]Treinamentos!$P$13)","v":{"$error":"#VALUE!"}},{"$f":"SUMIFS([3]Plano!$L$14:$L$1000,[3]Plano!$E$14:$E$1000,[3]Treinamentos!B27,[3]Plano!$M$14:$M$1000,[3]Treinamentos!$Q$13)","v":{"$error":"#VALUE!"}}]
[null,"Treinamento 16",null,null,null,"2 horas",300,null,null,{"$f":"COUNTIF([3]Plano!$E$14:$E$1000,[3]Treinamentos!B28)","v":{"$error":"#VALUE!"}},{"$f":"SUMIFS([3]Plano!$L$14:$L$1000,[3]Plano!$E$14:$E$1000,[3]Treinamentos!B28,[3]Plano!$M$14:$M$1000,[3]Treinamentos!$N$13)","v":{"$error":"#VALUE!"}},null,{"$f":"COUNTIFS([3]Plano!$E$14:$E$1000,[3]Treinamentos!B28,[3]Plano!$M$14:$M$1000,[3]Treinamentos!$P$13)","v":{"$error":"#VALUE!"}},{"$f":"SUMIFS([3]Plano!$L$14:$L$1000,[3]Plano!$E$14:$E$1000,[3]Treinamentos!B28,[3]Plano!$M$14:$M$1000,[3]Treinamentos!$Q$13)","v":{"$error":"#VALUE!"}}]
[null,"Treinamento 17",null,null,null,"2 horas",300,null,null,{"$f":"COUNTIF([3]Plano!$E$14:$E$1000,[3]Treinamentos!B29)","v":{"$error":"#VALUE!"}},{"$f":"SUMIFS([3]Plano!$L$14:$L$1000,[3]Plano!$E$14:$E$1000,[3]Treinamentos!B29,[3]Plano!$M$14:$M$1000,[3]Treinamentos!$N$13)","v":{"$error":"#VALUE!"}},null,{"$f":"COUNTIFS([3]Plano!$E$14:$E$1000,[3]Treinamentos!B29,[3]Plano!$M$14:$M$1000,[3]Treinamentos!$P$13)","v":{"$error":"#VALUE!"}},{"$f":"SUMIFS([3]Plano!$L$14:$L$1000,[3]Plano!$E$14:$E$1000,[3]Treinamentos!B29,[3]Plano!$M$14:$M$1000,[3]Treinamentos!$Q$13)","v":{"$error":"#VALUE!"}}]
[null,"Treinamento 18",null,null,null,"2 horas",300,null,null,{"$f":"COUNTIF([3]Plano!$E$14:$E$1000,[3]Treinamentos!B30)","v":{"$error":"#VALUE!"}},{"$f":"SUMIFS([3]Plano!$L$14:$L$1000,[3]Plano!$E$14:$E$1000,[3]Treinamentos!B30,[3]Plano!$M$14:$M$1000,[3]Treinamentos!$N$13)","v":{"$error":"#VALUE!"}},null,{"$f":"COUNTIFS([3]Plano!$E$14:$E$1000,[3]Treinamentos!B30,[3]Plano!$M$14:$M$1000,[3]Treinamentos!$P$13)","v":{"$error":"#VALUE!"}},{"$f":"SUMIFS([3]Plano!$L$14:$L$1000,[3]Plano!$E$14:$E$1000,[3]Treinamentos!B30,[3]Plano!$M$14:$M$1000,[3]Treinamentos!$Q$13)","v":{"$error":"#VALUE!"}}]
[null,"Treinamento 19",null,null,null,"2 horas",300,null,null,{"$f":"COUNTIF([3]Plano!$E$14:$E$1000,[3]Treinamentos!B31)","v":{"$error":"#VALUE!"}},{"$f":"SUMIFS([3]Plano!$L$14:$L$1000,[3]Plano!$E$14:$E$1000,[3]Treinamentos!B31,[3]Plano!$M$14:$M$1000,[3]Treinamentos!$N$13)","v":{"$error":"#VALUE!"}},null,{"$f":"COUNTIFS([3]Plano!$E$14:$E$1000,[3]Treinamentos!B31,[3]Plano!$M$14:$M$1000,[3]Treinamentos!$P$13)","v":{"$error":"#VALUE!"}},{"$f":"SUMIFS([3]Plano!$L$14:$L$1000,[3]Plano!$E$14:$E$1000,[3]Treinamentos!B31,[3]Plano!$M$14:$M$1000,[3]Treinamentos!$Q$13)","v":{"$error":"#VALUE!"}}]
[null,"Treinamento 20",null,null,null,"2 horas",300,null,null,{"$f":"COUNTIF([3]Plano!$E$14:$E$1000,[3]Treinamentos!B32)","v":{"$error":"#VALUE!"}},{"$f":"SUMIFS([3]Plano!$L$14:$L$1000,[3]Plano!$E$14:$E$1000,[3]Treinamentos!B32,[3]Plano!$M$14:$M$1000,[3]Treinamentos!$N$13)","v":{"$error":"#VALUE!"}},null,{"$f":"COUNTIFS([3]Plano!$E$14:$E$1000,[3]Treinamentos!B32,[3]Plano!$M$14:$M$1000,[3]Treinamentos!$P$13)","v":{"$error":"#VALUE!"}},{"$f":"SUMIFS([3]Plano!$L$14:$L$1000,[3]Plano!$E$14:$E$1000,[3]Treinamentos!B32,[3]Plano!$M$14:$M$1000,[3]Treinamentos!$Q$13)","v":{"$error":"#VALUE!"}}]
[null,"Treinamento 21",null,null,null,"2 horas",300,null,null,{"$f":"COUNTIF([3]Plano!$E$14:$E$1000,[3]Treinamentos!B33)","v":{"$error":"#VALUE!"}},{"$f":"SUMIFS([3]Plano!$L$14:$L$1000,[3]Plano!$E$14:$E$1000,[3]Treinamentos!B33,[3]Plano!$M$14:$M$1000,[3]Treinamentos!$N$13)","v":{"$error":"#VALUE!"}},null,{"$f":"COUNTIFS([3]Plano!$E$14:$E$1000,[3]Treinamentos!B33,[3]Plano!$M$14:$M$1000,[3]Treinamentos!$P$13)","v":{"$error":"#VALUE!"}},{"$f":"SUMIFS([3]Plano!$L$14:$L$1000,[3]Plano!$E$14:$E$1000,[3]Treinamentos!B33,[3]Plano!$M$14:$M$1000,[3]Treinamentos!$Q$13)","v":{"$error":"#VALUE!"}}]
[null,"Treinamento 22",null,null,null,"2 horas",300,null,null,{"$f":"COUNTIF([3]Plano!$E$14:$E$1000,[3]Treinamentos!B34)","v":{"$error":"#VALUE!"}},{"$f":"SUMIFS([3]Plano!$L$14:$L$1000,[3]Plano!$E$14:$E$1000,[3]Treinamentos!B34,[3]Plano!$M$14:$M$1000,[3]Treinamentos!$N$13)","v":{"$error":"#VALUE!"}},null,{"$f":"COUNTIFS([3]Plano!$E$14:$E$1000,[3]Treinamentos!B34,[3]Plano!$M$14:$M$1000,[3]Treinamentos!$P$13)","v":{"$error":"#VALUE!"}},{"$f":"SUMIFS([3]Plano!$L$14:$L$1000,[3]Plano!$E$14:$E$1000,[3]Treinamentos!B34,[3]Plano!$M$14:$M$1000,[3]Treinamentos!$Q$13)","v":{"$error":"#VALUE!"}}]
[null,"Treinamento 23",null,null,null,"2 horas",300,null,null,{"$f":"COUNTIF([3]Plano!$E$14:$E$1000,[3]Treinamentos!B35)","v":{"$error":"#VALUE!"}},{"$f":"SUMIFS([3]Plano!$L$14:$L$1000,[3]Plano!$E$14:$E$1000,[3]Treinamentos!B35,[3]Plano!$M$14:$M$1000,[3]Treinamentos!$N$13)","v":{"$error":"#VALUE!"}},null,{"$f":"COUNTIFS([3]Plano!$E$14:$E$1000,[3]Treinamentos!B35,[3]Plano!$M$14:$M$1000,[3]Treinamentos!$P$13)","v":{"$error":"#VALUE!"}},{"$f":"SUMIFS([3]Plano!$L$14:$L$1000,[3]Plano!$E$14:$E$1000,[3]Treinamentos!B35,[3]Plano!$M$14:$M$1000,[3]Treinamentos!$Q$13)","v":{"$error":"#VALUE!"}}]
[null,"Treinamento 24",null,null,null,"2 horas",300,null,null,{"$f":"COUNTIF([3]Plano!$E$14:$E$1000,[3]Treinamentos!B36)","v":{"$error":"#VALUE!"}},{"$f":"SUMIFS([3]Plano!$L$14:$L$1000,[3]Plano!$E$14:$E$1000,[3]Treinamentos!B36,[3]Plano!$M$14:$M$1000,[3]Treinamentos!$N$13)","v":{"$error":"#VALUE!"}},null,{"$f":"COUNTIFS([3]Plano!$E$14:$E$1000,[3]Treinamentos!B36,[3]Plano!$M$14:$M$1000,[3]Treinamentos!$P$13)","v":{"$error":"#VALUE!"}},{"$f":"SUMIFS([3]Plano!$L$14:$L$1000,[3]Plano!$E$14:$E$1000,[3]Treinamentos!B36,[3]Plano!$M$14:$M$1000,[3]Treinamentos!$Q$13)","v":{"$error":"#VALUE!"}}]
[null,"Treinamento 25",null,null,null,"2 horas",300,null,null,{"$f":"COUNTIF([3]Plano!$E$14:$E$1000,[3]Treinamentos!B37)","v":{"$error":"#VALUE!"}},{"$f":"SUMIFS([3]Plano!$L$14:$L$1000,[3]Plano!$E$14:$E$1000,[3]Treinamentos!B37,[3]Plano!$M$14:$M$1000,[3]Treinamentos!$N$13)","v":{"$error":"#VALUE!"}},null,{"$f":"COUNTIFS([3]Plano!$E$14:$E$1000,[3]Treinamentos!B37,[3]Plano!$M$14:$M$1000,[3]Treinamentos!$P$13)","v":{"$error":"#VALUE!"}},{"$f":"SUMIFS([3]Plano!$L$14:$L$1000,[3]Plano!$E$14:$E$1000,[3]Treinamentos!B37,[3]Plano!$M$14:$M$1000,[3]Treinamentos!$Q$13)","v":{"$error":"#VALUE!"}}]
[null,"Treinamento 26",null,null,null,"2 horas",300,null,null,{"$f":"COUNTIF([3]Plano!$E$14:$E$1000,[3]Treinamentos!B38)","v":{"$error":"#VALUE!"}},{"$f":"SUMIFS([3]Plano!$L$14:$L$1000,[3]Plano!$E$14:$E$1000,[3]Treinamentos!B38,[3]Plano!$M$14:$M$1000,[3]Treinamentos!$N$13)","v":{"$error":"#VALUE!"}},null,{"$f":"COUNTIFS([3]Plano!$E$14:$E$1000,[3]Treinamentos!B38,[3]Plano!$M$14:$M$1000,[3]Treinamentos!$P$13)","v":{"$error":"#VALUE!"}},{"$f":"SUMIFS([3]Plano!$L$14:$L$1000,[3]Plano!$E$14:$E$1000,[3]Treinamentos!B38,[3]Plano!$M$14:$M$1000,[3]Treinamentos!$Q$13)","v":{"$error":"#VALUE!"}}]
[null,"Treinamento 27",null,null,null,"2 horas",300,null,null,{"$f":"COUNTIF([3]Plano!$E$14:$E$1000,[3]Treinamentos!B39)","v":{"$error":"#VALUE!"}},{"$f":"SUMIFS([3]Plano!$L$14:$L$1000,[3]Plano!$E$14:$E$1000,[3]Treinamentos!B39,[3]Plano!$M$14:$M$1000,[3]Treinamentos!$N$13)","v":{"$error":"#VALUE!"}},null,{"$f":"COUNTIFS([3]Plano!$E$14:$E$1000,[3]Treinamentos!B39,[3]Plano!$M$14:$M$1000,[3]Treinamentos!$P$13)","v":{"$error":"#VALUE!"}},{"$f":"SUMIFS([3]Plano!$L$14:$L$1000,[3]Plano!$E$14:$E$1000,[3]Treinamentos!B39,[3]Plano!$M$14:$M$1000,[3]Treinamentos!$Q$13)","v":{"$error":"#VALUE!"}}]
[null,"Treinamento 28",null,null,null,"2 horas",300,null,null,{"$f":"COUNTIF([3]Plano!$E$14:$E$1000,[3]Treinamentos!B40)","v":{"$error":"#VALUE!"}},{"$f":"SUMIFS([3]Plano!$L$14:$L$1000,[3]Plano!$E$14:$E$1000,[3]Treinamentos!B40,[3]Plano!$M$14:$M$1000,[3]Treinamentos!$N$13)","v":{"$error":"#VALUE!"}},null,{"$f":"COUNTIFS([3]Plano!$E$14:$E$1000,[3]Treinamentos!B40,[3]Plano!$M$14:$M$1000,[3]Treinamentos!$P$13)","v":{"$error":"#VALUE!"}},{"$f":"SUMIFS([3]Plano!$L$14:$L$1000,[3]Plano!$E$14:$E$1000,[3]Treinamentos!B40,[3]Plano!$M$14:$M$1000,[3]Treinamentos!$Q$13)","v":{"$error":"#VALUE!"}}]
[null,"Treinamento 29",null,null,null,"2 horas",300,null,null,{"$f":"COUNTIF([3]Plano!$E$14:$E$1000,[3]Treinamentos!B41)","v":{"$error":"#VALUE!"}},{"$f":"SUMIFS([3]Plano!$L$14:$L$1000,[3]Plano!$E$14:$E$1000,[3]Treinamentos!B41,[3]Plano!$M$14:$M$1000,[3]Treinamentos!$N$13)","v":{"$error":"#VALUE!"}},null,{"$f":"COUNTIFS([3]Plano!$E$14:$E$1000,[3]Treinamentos!B41,[3]Plano!$M$14:$M$1000,[3]Treinamentos!$P$13)","v":{"$error":"#VALUE!"}},{"$f":"SUMIFS([3]Plano!$L$14:$L$1000,[3]Plano!$E$14:$E$1000,[3]Treinamentos!B41,[3]Plano!$M$14:$M$1000,[3]Treinamentos!$Q$13)","v":{"$error":"#VALUE!"}}]
[null,"Treinamento 30",null,null,null,"2 horas",300,null,null,{"$f":"COUNTIF([3]Plano!$E$14:$E$1000,[3]Treinamentos!B42)","v":{"$error":"#VALUE!"}},{"$f":"SUMIFS([3]Plano!$L$14:$L$1000,[3]Plano!$E$14:$E$1000,[3]Treinamentos!B42,[3]Plano!$M$14:$M$1000,[3]Treinamentos!$N$13)","v":{"$error":"#VALUE!"}},null,{"$f":"COUNTIFS([3]Plano!$E$14:$E$1000,[3]Treinamentos!B42,[3]Plano!$M$14:$M$1000,[3]Treinamentos!$P$13)","v":{"$error":"#VALUE!"}},{"$f":"SUMIFS([3]Plano!$L$14:$L$1000,[3]Plano!$E$14:$E$1000,[3]Treinamentos!B42,[3]Plano!$M$14:$M$1000,[3]Treinamentos!$Q$13)","v":{"$error":"#VALUE!"}}]

{"sheet":"Plano","index":4,"n_rows":999,"n_cols":17,"rows_kept":999,"cut":false,"hidden":false,"merged":[[10,1,10,12]]}
[]
[]
[]
[]
[]
[]
[]
[]
[]
[]
[null,"PLANEJAMENTO DE TREINAMENTOS\nINSIRA OS TREINAMENTOS PREVISTOS E ACOMPANHE OS TREINAMENTOS"]
[null,"COLABORADOR","ÁREA","CARGO","TREINAMENTO","CARGA HORÁRIA","OBJETIVO","MOTIVO TREINAMENTO","DATA INÍCIO","DATA TÉRMINO","CERTIFICADO ENTREGUE","INVESTIMENTO","STATUS",null,null,null,"Média"]
[null,"José da Silva",{"$f":"IF(B13=\"\",\"\",VLOOKUP(B13,Colab!$C$14:$E$63,2,0))","v":"Administrativo"},{"$f":"IF(B13=\"\",\"\",VLOOKUP(B13,Colab!$C$14:$E$63,3,0))","v":"Assistente Administrativo"},"Treinamento 1",{"$f":"IF(E13=\"\",\"\",VLOOKUP(E13,Treinamentos!$B$13:$G$42,5,0))","v":"8 horas"},null,null,null,null,"Sim",{"$f":"IF(E13=\"\",\"\",VLOOKUP(E13,Treinamentos!$B$13:$G$42,6,0))","v":2000},"Concluído",null,null,null,{"$f":"IFERROR(AVERAGEIF(C13:M13,\">0\"),\"\")","v":2000}]
[null,"João Alves",{"$f":"IF(B14=\"\",\"\",VLOOKUP(B14,Colab!$C$14:$E$63,2,0))","v":"Produção"},{"$f":"IF(B14=\"\",\"\",VLOOKUP(B14,Colab!$C$14:$E$63,3,0))","v":"Auxiliar de Produção"},"Treinamento 2",{"$f":"IF(E14=\"\",\"\",VLOOKUP(E14,Treinamentos!$B$13:$G$42,5,0))","v":"4 horas"},null,null,null,null,null,{"$f":"IF(E14=\"\",\"\",VLOOKUP(E14,Treinamentos!$B$13:$G$42,6,0))","v":500},"Programado",null,null,null,500]
[null,"João Alves",{"$f":"IF(B15=\"\",\"\",VLOOKUP(B15,Colab!$C$14:$E$63,2,0))","v":"Produção"},{"$f":"IF(B15=\"\",\"\",VLOOKUP(B15,Colab!$C$14:$E$63,3,0))","v":"Auxiliar de Produção"},"Treinamento 3",{"$f":"IF(E15=\"\",\"\",VLOOKUP(E15,Treinamentos!$B$13:$G$42,5,0))","v":"2 horas"},null,null,null,null,null,{"$f":"IF(E15=\"\",\"\",VLOOKUP(E15,Treinamentos!$B$13:$G$42,6,0))","v":300},"Cancelado",null,null,null,300]
[null,null,{"$f":"IF(B16=\"\",\"\",VLOOKUP(B16,Colab!$C$14:$E$63,2,0))","v":""},{"$f":"IF(B16=\"\",\"\",VLOOKUP(B16,Colab!$C$14:$E$63,3,0))","v":""},null,{"$f":"IF(E16=\"\",\"\",VLOOKUP(E16,Treinamentos!$B$13:$G$42,5,0))","v":""},null,null,null,null,null,{"$f":"IF(E16=\"\",\"\",VLOOKUP(E16,Treinamentos!$B$13:$G$42,6,0))","v":""},null,null,null,null,""]
[null,null,{"$f":"IF(B17=\"\",\"\",VLOOKUP(B17,Colab!$C$14:$E$63,2,0))","v":""},{"$f":"IF(B17=\"\",\"\",VLOOKUP(B17,Colab!$C$14:$E$63,3,0))","v":""},null,{"$f":"IF(E17=\"\",\"\",VLOOKUP(E17,Treinamentos!$B$13:$G$42,5,0))","v":""},null,null,null,null,null,{"$f":"IF(E17=\"\",\"\",VLOOKUP(E17,Treinamentos!$B$13:$G$42,6,0))","v":""},null,null,null,null,""]
[null,null,{"$f":"IF(B18=\"\",\"\",VLOOKUP(B18,Colab!$C$14:$E$63,2,0))","v":""},{"$f":"IF(B18=\"\",\"\",VLOOKUP(B18,Colab!$C$14:$E$63,3,0))","v":""},null,{"$f":"IF(E18=\"\",\"\",VLOOKUP(E18,Treinamentos!$B$13:$G$42,5,0))","v":""},null,null,null,null,null,{"$f":"IF(E18=\"\",\"\",VLOOKUP(E18,Treinamentos!$B$13:$G$42,6,0))","v":""},null,null,null,null,""]
[null,null,{"$f":"IF(B19=\"\",\"\",VLOOKUP(B19,Colab!$C$14:$E$63,2,0))","v":""},{"$f":"IF(B19=\"\",\"\",VLOOKUP(B19,Colab!$C$14:$E$63,3,0))","v":""},null,{"$f":"IF(E19=\"\",\"\",VLOOKUP(E19,Treinamentos!$B$13:$G$42,5,0))","v":""},null,null,null,null,null,{"$f":"IF(E19=\"\",\"\",VLOOKUP(E19,Treinamentos!$B$13:$G$42,6,0))","v":""},null,null,null,null,""]
[null,null,{"$f":"IF(B20=\"\",\"\",VLOOKUP(B20,Colab!$C$14:$E$63,2,0))","v":""},{"$f":"IF(B20=\"\",\"\",VLOOKUP(B20,Colab!$C$14:$E$63,3,0))","v":""},null,{"$f":"IF(E20=\"\",\"\",VLOOKUP(E20,Treinamentos!$B$13:$G$42,5,0))","v":""},null,null,null,null,null,{"$f":"IF(E20=\"\",\"\",VLOOKUP(E20,Treinamentos!$B$13:$G$42,6,0))","v":""},null,null,null,null,""]
[null,null,{"$f":"IF(B21=\"\",\"\",VLOOKUP(B21,Colab!$C$14:$E$63,2,0))","v":""},{"$f":"IF(B21=\"\",\"\",VLOOKUP(B21,Colab!$C$14:$E$63,3,0))","v":""},null,{"$f":"IF(E21=\"\",\"\",VLOOKUP(E21,Treinamentos!$B$13:$G$42,5,0))","v":""},null,null,null,null,null,{"$f":"IF(E21=\"\",\"\",VLOOKUP(E21,Treinamentos!$B$13:$G$42,6,0))","v":""},null,null,null,null,""]
[null,null,{"$f":"IF(B22=\"\",\"\",VLOOKUP(B22,Colab!$C$14:$E$63,2,0))","v":""},{"$f":"IF(B22=\"\",\"\",VLOOKUP(B22,Colab!$C$14:$E$63,3,0))","v":""},null,{"$f":"IF(E22=\"\",\"\",VLOOKUP(E22,Treinamentos!$B$13:$G$42,5,0))","v":""},null,null,null,null,null,{"$f":"IF(E22=\"\",\"\",VLOOKUP(E22,Treinamentos!$B$13:$G$42,6,0))","v":""},null,null,null,null,""]
[null,null,{"$f":"IF(B23=\"\",\"\",VLOOKUP(B23,Colab!$C$14:$E$63,2,0))","v":""},{"$f":"IF(B23=\"\",\"\",VLOOKUP(B23,Colab!$C$14:$E$63,3,0))","v":""},null,{"$f":"IF(E23=\"\",\"\",VLOOKUP(E23,Treinamentos!$B$13:$G$42,5,0))","v":""},null,null,null,null,null,{"$f":"IF(E23=\"\",\"\",VLOOKUP(E23,Treinamentos!$B$13:$G$42,6,0))","v":""},null,null,null,null,""]
[null,null,{"$f":"IF(B24=\"\",\"\",VLOOKUP(B24,Colab!$C$14:$E$63,2,0))","v":""},{"$f":"IF(B24=\"\",\"\",VLOOKUP(B24,Colab!$C$14:$E$63,3,0))","v":""},null,{"$f":"IF(E24=\"\",\"\",VLOOKUP(E24,Treinamentos!$B$13:$G$42,5,0))","v":""},null,null,null,null,null,{"$f":"IF(E24=\"\",\"\",VLOOKUP(E24,Treinamentos!$B$13:$G$42,6,0))","v":""},null,null,null,null,""]
[null,null,{"$f":"IF(B25=\"\",\"\",VLOOKUP(B25,Colab!$C$14:$E$63,2,0))","v":""},{"$f":"IF(B25=\"\",\"\",VLOOKUP(B25,Colab!$C$14:$E$63,3,0))","v":""},null,{"$f":"IF(E25=\"\",\"\",VLOOKUP(E25,Treinamentos!$B$13:$G$42,5,0))","v":""},null,null,null,null,null,{"$f":"IF(E25=\"\",\"\",VLOOKUP(E25,Treinamentos!$B$13:$G$42,6,0))","v":""},null,null,null,null,""]
[null,null,{"$f":"IF(B26=\"\",\"\",VLOOKUP(B26,Colab!$C$14:$E$63,2,0))","v":""},{"$f":"IF(B26=\"\",\"\",VLOOKUP(B26,Colab!$C$14:$E$63,3,0))","v":""},null,{"$f":"IF(E26=\"\",\"\",VLOOKUP(E26,Treinamentos!$B$13:$G$42,5,0))","v":""},null,null,null,null,null,{"$f":"IF(E26=\"\",\"\",VLOOKUP(E26,Treinamentos!$B$13:$G$42,6,0))","v":""},null,null,null,null,""]
[null,null,{"$f":"IF(B27=\"\",\"\",VLOOKUP(B27,Colab!$C$14:$E$63,2,0))","v":""},{"$f":"IF(B27=\"\",\"\",VLOOKUP(B27,Colab!$C$14:$E$63,3,0))","v":""},null,{"$f":"IF(E27=\"\",\"\",VLOOKUP(E27,Treinamentos!$B$13:$G$42,5,0))","v":""},null,null,null,null,null,{"$f":"IF(E27=\"\",\"\",VLOOKUP(E27,Treinamentos!$B$13:$G$42,6,0))","v":""},null,null,null,null,""]
[null,null,{"$f":"IF(B28=\"\",\"\",VLOOKUP(B28,Colab!$C$14:$E$63,2,0))","v":""},{"$f":"IF(B28=\"\",\"\",VLOOKUP(B28,Colab!$C$14:$E$63,3,0))","v":""},null,{"$f":"IF(E28=\"\",\"\",VLOOKUP(E28,Treinamentos!$B$13:$G$42,5,0))","v":""},null,null,null,null,null,{"$f":"IF(E28=\"\",\"\",VLOOKUP(E28,Treinamentos!$B$13:$G$42,6,0))","v":""},null,null,null,null,""]
[null,null,{"$f":"IF(B29=\"\",\"\",VLOOKUP(B29,Colab!$C$14:$E$63,2,0))","v":""},{"$f":"IF(B29=\"\",\"\",VLOOKUP(B29,Colab!$C$14:$E$63,3,0))","v":""},null,{"$f":"IF(E29=\"\",\"\",VLOOKUP(E29,Treinamentos!$B$13:$G$42,5,0))","v":""},null,null,null,null,null,{"$f":"IF(E29=\"\",\"\",VLOOKUP(E29,Treinamentos!$B$13:$G$42,6,0))","v":""},null,null,null,null,""]
[null,null,{"$f":"IF(B30=\"\",\"\",VLOOKUP(B30,Colab!$C$14:$E$63,2,0))","v":""},{"$f":"IF(B30=\"\",\"\",VLOOKUP(B30,Colab!$C$14:$E$63,3,0))","v":""},null,{"$f":"IF(E30=\"\",\"\",VLOOKUP(E30,Treinamentos!$B$13:$G$42,5,0))","v":""},null,null,null,null,null,{"$f":"IF(E30=\"\",\"\",VLOOKUP(E30,Treinamentos!$B$13:$G$42,6,0))","v":""},null,null,null,null,""]
[null,null,{"$f":"IF(B31=\"\",\"\",VLOOKUP(B31,Colab!$C$14:$E$63,2,0))","v":""},{"$f":"IF(B31=\"\",\"\",VLOOKUP(B31,Colab!$C$14:$E$63,3,0))","v":""},null,{"$f":"IF(E31=\"\",\"\",VLOOKUP(E31,Treinamentos!$B$13:$G$42,5,0))","v":""},null,null,null,null,null,{"$f":"IF(E31=\"\",\"\",VLOOKUP(E31,Treinamentos!$B$13:$G$42,6,0))","v":""},null,null,null,null,""]
[null,null,{"$f":"IF(B32=\"\",\"\",VLOOKUP(B32,Colab!$C$14:$E$63,2,0))","v":""},{"$f":"IF(B32=\"\",\"\",VLOOKUP(B32,Colab!$C$14:$E$63,3,0))","v":""},null,{"$f":"IF(E32=\"\",\"\",VLOOKUP(E32,Treinamentos!$B$13:$G$42,5,0))","v":""},null,null,null,null,null,{"$f":"IF(E32=\"\",\"\",VLOOKUP(E32,Treinamentos!$B$13:$G$42,6,0))","v":""},null,null,null,null,""]
[null,null,{"$f":"IF(B33=\"\",\"\",VLOOKUP(B33,Colab!$C$14:$E$63,2,0))","v":""},{"$f":"IF(B33=\"\",\"\",VLOOKUP(B33,Colab!$C$14:$E$63,3,0))","v":""},null,{"$f":"IF(E33=\"\",\"\",VLOOKUP(E33,Treinamentos!$B$13:$G$42,5,0))","v":""},null,null,null,null,null,{"$f":"IF(E33=\"\",\"\",VLOOKUP(E33,Treinamentos!$B$13:$G$42,6,0))","v":""},null,null,null,null,""]
[null,null,{"$f":"IF(B34=\"\",\"\",VLOOKUP(B34,Colab!$C$14:$E$63,2,0))","v":""},{"$f":"IF(B34=\"\",\"\",VLOOKUP(B34,Colab!$C$14:$E$63,3,0))","v":""},null,{"$f":"IF(E34=\"\",\"\",VLOOKUP(E34,Treinamentos!$B$13:$G$42,5,0))","v":""},null,null,null,null,null,{"$f":"IF(E34=\"\",\"\",VLOOKUP(E34,Treinamentos!$B$13:$G$42,6,0))","v":""},null,null,null,null,""]
[null,null,{"$f":"IF(B35=\"\",\"\",VLOOKUP(B35,Colab!$C$14:$E$63,2,0))","v":""},{"$f":"IF(B35=\"\",\"\",VLOOKUP(B35,Colab!$C$14:$E$63,3,0))","v":""},null,{"$f":"IF(E35=\"\",\"\",VLOOKUP(E35,Treinamentos!$B$13:$G$42,5,0))","v":""},null,null,null,null,null,{"$f":"IF(E35=\"\",\"\",VLOOKUP(E35,Treinamentos!$B$13:$G$42,6,0))","v":""},null,null,null,null,""]
[null,null,{"$f":"IF(B36=\"\",\"\",VLOOKUP(B36,Colab!$C$14:$E$63,2,0))","v":""},{"$f":"IF(B36=\"\",\"\",VLOOKUP(B36,Colab!$C$14:$E$63,3,0))","v":""},null,{"$f":"IF(E36=\"\",\"\",VLOOKUP(E36,Treinamentos!$B$13:$G$42,5,0))","v":""},null,null,null,null,null,{"$f":"IF(E36=\"\",\"\",VLOOKUP(E36,Treinamentos!$B$13:$G$42,6,0))","v":""},null,null,null,null,""]
[null,null,{"$f":"IF(B37=\"\",\"\",VLOOKUP(B37,Colab!$C$14:$E$63,2,0))","v":""},{"$f":"IF(B37=\"\",\"\",VLOOKUP(B37,Colab!$C$14:$E$63,3,0))","v":""},null,{"$f":"IF(E37=\"\",\"\",VLOOKUP(E37,Treinamentos!$B$13:$G$42,5,0))","v":""},null,null,null,null,null,{"$f":"IF(E37=\"\",\"\",VLOOKUP(E37,Treinamentos!$B$13:$G$42,6,0))","v":""},null,null,null,null,""]
[null,null,{"$f":"IF(B38=\"\",\"\",VLOOKUP(B38,Colab!$C$14:$E$63,2,0))","v":""},{"$f":"IF(B38=\"\",\"\",VLOOKUP(B38,Colab!$C$14:$E$63,3,0))","v":""},null,{"$f":"IF(E38=\"\",\"\",VLOOKUP(E38,Treinamentos!$B$13:$G$42,5,0))","v":""},null,null,null,null,null,{"$f":"IF(E38=\"\",\"\",VLOOKUP(E38,Treinamentos!$B$13:$G$42,6,0))","v":""},null,null,null,null,""]
[null,null,{"$f":"IF(B39=\"\",\"\",VLOOKUP(B39,Colab!$C$14:$E$63,2,0))","v":""},{"$f":"IF(B39=\"\",\"\",VLOOKUP(B39,Colab!$C$14:$E$63,3,0))","v":""},null,{"$f":"IF(E39=\"\",\"\",VLOOKUP(E39,Treinamentos!$B$13:$G$42,5,0))","v":""},null,null,null,null,null,{"$f":"IF(E39=\"\",\"\",VLOOKUP(E39,Treinamentos!$B$13:$G$42,6,0))","v":""},null,null,null,null,""]
[null,null,{"$f":"IF(B40=\"\",\"\",VLOOKUP(B40,Colab!$C$14:$E$63,2,0))","v":""},{"$f":"IF(B40=\"\",\"\",VLOOKUP(B40,Colab!$C$14:$E$63,3,0))","v":""},null,{"$f":"IF(E40=\"\",\"\",VLOOKUP(E40,Treinamentos!$B$13:$G$42,5,0))","v":""},null,null,null,null,null,{"$f":"IF(E40=\"\",\"\",VLOOKUP(E40,Treinamentos!$B$13:$G$42,6,0))","v":""},null,null,null,null,""]
[null,null,{"$f":"IF(B41=\"\",\"\",VLOOKUP(B41,Colab!$C$14:$E$63,2,0))","v":""},{"$f":"IF(B41=\"\",\"\",VLOOKUP(B41,Colab!$C$14:$E$63,3,0))","v":""},null,{"$f":"IF(E41=\"\",\"\",VLOOKUP(E41,Treinamentos!$B$13:$G$42,5,0))","v":""},null,null,null,null,null,{"$f":"IF(E41=\"\",\"\",VLOOKUP(E41,Treinamentos!$B$13:$G$42,6,0))","v":""},null,null,null,null,""]
[null,null,{"$f":"IF(B42=\"\",\"\",VLOOKUP(B42,Colab!$C$14:$E$63,2,0))","v":""},{"$f":"IF(B42=\"\",\"\",VLOOKUP(B42,Colab!$C$14:$E$63,3,0))","v":""},null,{"$f":"IF(E42=\"\",\"\",VLOOKUP(E42,Treinamentos!$B$13:$G$42,5,0))","v":""},null,null,null,null,null,{"$f":"IF(E42=\"\",\"\",VLOOKUP(E42,Treinamentos!$B$13:$G$42,6,0))","v":""},null,null,null,null,""]
[null,null,{"$f":"IF(B43=\"\",\"\",VLOOKUP(B43,Colab!$C$14:$E$63,2,0))","v":""},{"$f":"IF(B43=\"\",\"\",VLOOKUP(B43,Colab!$C$14:$E$63,3,0))","v":""},null,{"$f":"IF(E43=\"\",\"\",VLOOKUP(E43,Treinamentos!$B$13:$G$42,5,0))","v":""},null,null,null,null,null,{"$f":"IF(E43=\"\",\"\",VLOOKUP(E43,Treinamentos!$B$13:$G$42,6,0))","v":""},null,null,null,null,""]
[null,null,{"$f":"IF(B44=\"\",\"\",VLOOKUP(B44,Colab!$C$14:$E$63,2,0))","v":""},{"$f":"IF(B44=\"\",\"\",VLOOKUP(B44,Colab!$C$14:$E$63,3,0))","v":""},null,{"$f":"IF(E44=\"\",\"\",VLOOKUP(E44,Treinamentos!$B$13:$G$42,5,0))","v":""},null,null,null,null,null,{"$f":"IF(E44=\"\",\"\",VLOOKUP(E44,Treinamentos!$B$13:$G$42,6,0))","v":""},null,null,null,null,""]
[null,null,{"$f":"IF(B45=\"\",\"\",VLOOKUP(B45,Colab!$C$14:$E$63,2,0))","v":""},{"$f":"IF(B45=\"\",\"\",VLOOKUP(B45,Colab!$C$14:$E$63,3,0))","v":""},null,{"$f":"IF(E45=\"\",\"\",VLOOKUP(E45,Treinamentos!$B$13:$G$42,5,0))","v":""},null,null,null,null,null,{"$f":"IF(E45=\"\",\"\",VLOOKUP(E45,Treinamentos!$B$13:$G$42,6,0))","v":""},null,null,null,null,{"$f":"IFERROR(AVERAGEIF(C45:M45,\">0\"),\"\")","v":""}]
[null,null,{"$f":"IF(B46=\"\",\"\",VLOOKUP(B46,Colab!$C$14:$E$63,2,0))","v":""},{"$f":"IF(B46=\"\",\"\",VLOOKUP(B46,Colab!$C$14:$E$63,3,0))","v":""},null,{"$f":"IF(E46=\"\",\"\",VLOOKUP(E46,Treinamentos!$B$13:$G$42,5,0))","v":""},null,null,null,null,null,{"$f":"IF(E46=\"\",\"\",VLOOKUP(E46,Treinamentos!$B$13:$G$42,6,0))","v":""},null,null,null,null,""]
[null,null,{"$f":"IF(B47=\"\",\"\",VLOOKUP(B47,Colab!$C$14:$E$63,2,0))","v":""},{"$f":"IF(B47=\"\",\"\",VLOOKUP(B47,Colab!$C$14:$E$63,3,0))","v":""},null,{"$f":"IF(E47=\"\",\"\",VLOOKUP(E47,Treinamentos!$B$13:$G$42,5,0))","v":""},null,null,null,null,null,{"$f":"IF(E47=\"\",\"\",VLOOKUP(E47,Treinamentos!$B$13:$G$42,6,0))","v":""},null,null,null,null,""]
[null,null,{"$f":"IF(B48=\"\",\"\",VLOOKUP(B48,Colab!$C$14:$E$63,2,0))","v":""},{"$f":"IF(B48=\"\",\"\",VLOOKUP(B48,Colab!$C$14:$E$63,3,0))","v":""},null,{"$f":"IF(E48=\"\",\"\",VLOOKUP(E48,Treinamentos!$B$13:$G$42,5,0))","v":""},null,null,null,null,null,{"$f":"IF(E48=\"\",\"\",VLOOKUP(E48,Treinamentos!$B$13:$G$42,6,0))","v":""},null,null,null,null,""]
[null,null,{"$f":"IF(B49=\"\",\"\",VLOOKUP(B49,Colab!$C$14:$E$63,2,0))","v":""},{"$f":"IF(B49=\"\",\"\",VLOOKUP(B49,Colab!$C$14:$E$63,3,0))","v":""},null,{"$f":"IF(E49=\"\",\"\",VLOOKUP(E49,Treinamentos!$B$13:$G$42,5,0))","v":""},null,null,null,null,null,{"$f":"IF(E49=\"\",\"\",VLOOKUP(E49,Treinamentos!$B$13:$G$42,6,0))","v":""},null,null,null,null,""]
[null,null,{"$f":"IF(B50=\"\",\"\",VLOOKUP(B50,Colab!$C$14:$E$63,2,0))","v":""},{"$f":"IF(B50=\"\",\"\",VLOOKUP(B50,Colab!$C$14:$E$63,3,0))","v":""},null,{"$f":"IF(E50=\"\",\"\",VLOOKUP(E50,Treinamentos!$B$13:$G$42,5,0))","v":""},null,null,null,null,null,{"$f":"IF(E50=\"\",\"\",VLOOKUP(E50,Treinamentos!$B$13:$G$42,6,0))","v":""},null,null,null,null,""]
[null,null,{"$f":"IF(B51=\"\",\"\",VLOOKUP(B51,Colab!$C$14:$E$63,2,0))","v":""},{"$f":"IF(B51=\"\",\"\",VLOOKUP(B51,Colab!$C$14:$E$63,3,0))","v":""},null,{"$f":"IF(E51=\"\",\"\",VLOOKUP(E51,Treinamentos!$B$13:$G$42,5,0))","v":""},null,null,null,null,null,{"$f":"IF(E51=\"\",\"\",VLOOKUP(E51,Treinamentos!$B$13:$G$42,6,0))","v":""},null,null,null,null,""]
[null,null,{"$f":"IF(B52=\"\",\"\",VLOOKUP(B52,Colab!$C$14:$E$63,2,0))","v":""},{"$f":"IF(B52=\"\",\"\",VLOOKUP(B52,Colab!$C$14:$E$63,3,0))","v":""},null,{"$f":"IF(E52=\"\",\"\",VLOOKUP(E52,Treinamentos!$B$13:$G$42,5,0))","v":""},null,null,null,null,null,{"$f":"IF(E52=\"\",\"\",VLOOKUP(E52,Treinamentos!$B$13:$G$42,6,0))","v":""},null,null,null,null,""]
[null,null,{"$f":"IF(B53=\"\",\"\",VLOOKUP(B53,Colab!$C$14:$E$63,2,0))","v":""},{"$f":"IF(B53=\"\",\"\",VLOOKUP(B53,Colab!$C$14:$E$63,3,0))","v":""},null,{"$f":"IF(E53=\"\",\"\",VLOOKUP(E53,Treinamentos!$B$13:$G$42,5,0))","v":""},null,null,null,null,null,{"$f":"IF(E53=\"\",\"\",VLOOKUP(E53,Treinamentos!$B$13:$G$42,6,0))","v":""},null,null,null,null,""]
[null,null,{"$f":"IF(B54=\"\",\"\",VLOOKUP(B54,Colab!$C$14:$E$63,2,0))","v":""},{"$f":"IF(B54=\"\",\"\",VLOOKUP(B54,Colab!$C$14:$E$63,3,0))","v":""},null,{"$f":"IF(E54=\"\",\"\",VLOOKUP(E54,Treinamentos!$B$13:$G$42,5,0))","v":""},null,null,null,null,null,{"$f":"IF(E54=\"\",\"\",VLOOKUP(E54,Treinamentos!$B$13:$G$42,6,0))","v":""},null,null,null,null,""]
[null,null,{"$f":"IF(B55=\"\",\"\",VLOOKUP(B55,Colab!$C$14:$E$63,2,0))","v":""},{"$f":"IF(B55=\"\",\"\",VLOOKUP(B55,Colab!$C$14:$E$63,3,0))","v":""},null,{"$f":"IF(E55=\"\",\"\",VLOOKUP(E55,Treinamentos!$B$13:$G$42,5,0))","v":""},null,null,null,null,null,{"$f":"IF(E55=\"\",\"\",VLOOKUP(E55,Treinamentos!$B$13:$G$42,6,0))","v":""},null,null,null,null,""]
[null,null,{"$f":"IF(B56=\"\",\"\",VLOOKUP(B56,Colab!$C$14:$E$63,2,0))","v":""},{"$f":"IF(B56=\"\",\"\",VLOOKUP(B56,Colab!$C$14:$E$63,3,0))","v":""},null,{"$f":"IF(E56=\"\",\"\",VLOOKUP(E56,Treinamentos!$B$13:$G$42,5,0))","v":""},null,null,null,null,null,{"$f":"IF(E56=\"\",\"\",VLOOKUP(E56,Treinamentos!$B$13:$G$42,6,0))","v":""},null,null,null,null,""]
[null,null,{"$f":"IF(B57=\"\",\"\",VLOOKUP(B57,Colab!$C$14:$E$63,2,0))","v":""},{"$f":"IF(B57=\"\",\"\",VLOOKUP(B57,Colab!$C$14:$E$63,3,0))","v":""},null,{"$f":"IF(E57=\"\",\"\",VLOOKUP(E57,Treinamentos!$B$13:$G$42,5,0))","v":""},null,null,null,null,null,{"$f":"IF(E57=\"\",\"\",VLOOKUP(E57,Treinamentos!$B$13:$G$42,6,0))","v":""},null,null,null,null,""]
[null,null,{"$f":"IF(B58=\"\",\"\",VLOOKUP(B58,Colab!$C$14:$E$63,2,0))","v":""},{"$f":"IF(B58=\"\",\"\",VLOOKUP(B58,Colab!$C$14:$E$63,3,0))","v":""},null,{"$f":"IF(E58=\"\",\"\",VLOOKUP(E58,Treinamentos!$B$13:$G$42,5,0))","v":""},null,null,null,null,null,{"$f":"IF(E58=\"\",\"\",VLOOKUP(E58,Treinamentos!$B$13:$G$42,6,0))","v":""},null,null,null,null,""]
[null,null,{"$f":"IF(B59=\"\",\"\",VLOOKUP(B59,Colab!$C$14:$E$63,2,0))","v":""},{"$f":"IF(B59=\"\",\"\",VLOOKUP(B59,Colab!$C$14:$E$63,3,0))","v":""},null,{"$f":"IF(E59=\"\",\"\",VLOOKUP(E59,Treinamentos!$B$13:$G$42,5,0))","v":""},null,null,null,null,null,{"$f":"IF(E59=\"\",\"\",VLOOKUP(E59,Treinamentos!$B$13:$G$42,6,0))","v":""},null,null,null,null,""]
[null,null,{"$f":"IF(B60=\"\",\"\",VLOOKUP(B60,Colab!$C$14:$E$63,2,0))","v":""},{"$f":"IF(B60=\"\",\"\",VLOOKUP(B60,Colab!$C$14:$E$63,3,0))","v":""},null,{"$f":"IF(E60=\"\",\"\",VLOOKUP(E60,Treinamentos!$B$13:$G$42,5,0))","v":""},null,null,null,null,null,{"$f":"IF(E60=\"\",\"\",VLOOKUP(E60,Treinamentos!$B$13:$G$42,6,0))","v":""},null,null,null,null,""]
[null,null,{"$f":"IF(B61=\"\",\"\",VLOOKUP(B61,Colab!$C$14:$E$63,2,0))","v":""},{"$f":"IF(B61=\"\",\"\",VLOOKUP(B61,Colab!$C$14:$E$63,3,0))","v":""},null,{"$f":"IF(E61=\"\",\"\",VLOOKUP(E61,Treinamentos!$B$13:$G$42,5,0))","v":""},null,null,null,null,null,{"$f":"IF(E61=\"\",\"\",VLOOKUP(E61,Treinamentos!$B$13:$G$42,6,0))","v":""},null,null,null,null,""]
[null,null,{"$f":"IF(B62=\"\",\"\",VLOOKUP(B62,Colab!$C$14:$E$63,2,0))","v":""},{"$f":"IF(B62=\"\",\"\",VLOOKUP(B62,Colab!$C$14:$E$63,3,0))","v":""},null,{"$f":"IF(E62=\"\",\"\",VLOOKUP(E62,Treinamentos!$B$13:$G$42,5,0))","v":""},null,null,null,null,null,{"$f":"IF(E62=\"\",\"\",VLOOKUP(E62,Treinamentos!$B$13:$G$42,6,0))","v":""},null,null,null,null,""]
[null,null,{"$f":"IF(B63=\"\",\"\",VLOOKUP(B63,Colab!$C$14:$E$63,2,0))","v":""},{"$f":"IF(B63=\"\",\"\",VLOOKUP(B63,Colab!$C$14:$E$63,3,0))","v":""},null,{"$f":"IF(E63=\"\",\"\",VLOOKUP(E63,Treinamentos!$B$13:$G$42,5,0))","v":""},null,null,null,null,null,{"$f":"IF(E63=\"\",\"\",VLOOKUP(E63,Treinamentos!$B$13:$G$42,6,0))","v":""}]
[null,null,{"$f":"IF(B64=\"\",\"\",VLOOKUP(B64,Colab!$C$14:$E$63,2,0))","v":""},{"$f":"IF(B64=\"\",\"\",VLOOKUP(B64,Colab!$C$14:$E$63,3,0))","v":""},null,{"$f":"IF(E64=\"\",\"\",VLOOKUP(E64,Treinamentos!$B$13:$G$42,5,0))","v":""},null,null,null,null,null,{"$f":"IF(E64=\"\",\"\",VLOOKUP(E64,Treinamentos!$B$13:$G$42,6,0))","v":""}]
[null,null,{"$f":"IF(B65=\"\",\"\",VLOOKUP(B65,Colab!$C$14:$E$63,2,0))","v":""},{"$f":"IF(B65=\"\",\"\",VLOOKUP(B65,Colab!$C$14:$E$63,3,0))","v":""},null,{"$f":"IF(E65=\"\",\"\",VLOOKUP(E65,Treinamentos!$B$13:$G$42,5,0))","v":""},null,null,null,null,null,{"$f":"IF(E65=\"\",\"\",VLOOKUP(E65,Treinamentos!$B$13:$G$42,6,0))","v":""}]
[null,null,{"$f":"IF(B66=\"\",\"\",VLOOKUP(B66,Colab!$C$14:$E$63,2,0))","v":""},{"$f":"IF(B66=\"\",\"\",VLOOKUP(B66,Colab!$C$14:$E$63,3,0))","v":""},null,{"$f":"IF(E66=\"\",\"\",VLOOKUP(E66,Treinamentos!$B$13:$G$42,5,0))","v":""},null,null,null,null,null,{"$f":"IF(E66=\"\",\"\",VLOOKUP(E66,Treinamentos!$B$13:$G$42,6,0))","v":""}]
[null,null,{"$f":"IF(B67=\"\",\"\",VLOOKUP(B67,Colab!$C$14:$E$63,2,0))","v":""},{"$f":"IF(B67=\"\",\"\",VLOOKUP(B67,Colab!$C$14:$E$63,3,0))","v":""},null,{"$f":"IF(E67=\"\",\"\",VLOOKUP(E67,Treinamentos!$B$13:$G$42,5,0))","v":""},null,null,null,null,null,{"$f":"IF(E67=\"\",\"\",VLOOKUP(E67,Treinamentos!$B$13:$G$42,6,0))","v":""}]
[null,null,{"$f":"IF(B68=\"\",\"\",VLOOKUP(B68,Colab!$C$14:$E$63,2,0))","v":""},{"$f":"IF(B68=\"\",\"\",VLOOKUP(B68,Colab!$C$14:$E$63,3,0))","v":""},null,{"$f":"IF(E68=\"\",\"\",VLOOKUP(E68,Treinamentos!$B$13:$G$42,5,0))","v":""},null,null,null,null,null,{"$f":"IF(E68=\"\",\"\",VLOOKUP(E68,Treinamentos!$B$13:$G$42,6,0))","v":""}]
[null,null,{"$f":"IF(B69=\"\",\"\",VLOOKUP(B69,Colab!$C$14:$E$63,2,0))","v":""},{"$f":"IF(B69=\"\",\"\",VLOOKUP(B69,Colab!$C$14:$E$63,3,0))","v":""},null,{"$f":"IF(E69=\"\",\"\",VLOOKUP(E69,Treinamentos!$B$13:$G$42,5,0))","v":""},null,null,null,null,null,{"$f":"IF(E69=\"\",\"\",VLOOKUP(E69,Treinamentos!$B$13:$G$42,6,0))","v":""}]
[null,null,{"$f":"IF(B70=\"\",\"\",VLOOKUP(B70,Colab!$C$14:$E$63,2,0))","v":""},{"$f":"IF(B70=\"\",\"\",VLOOKUP(B70,Colab!$C$14:$E$63,3,0))","v":""},null,{"$f":"IF(E70=\"\",\"\",VLOOKUP(E70,Treinamentos!$B$13:$G$42,5,0))","v":""},null,null,null,null,null,{"$f":"IF(E70=\"\",\"\",VLOOKUP(E70,Treinamentos!$B$13:$G$42,6,0))","v":""}]
[null,null,{"$f":"IF(B71=\"\",\"\",VLOOKUP(B71,Colab!$C$14:$E$63,2,0))","v":""},{"$f":"IF(B71=\"\",\"\",VLOOKUP(B71,Colab!$C$14:$E$63,3,0))","v":""},null,{"$f":"IF(E71=\"\",\"\",VLOOKUP(E71,Treinamentos!$B$13:$G$42,5,0))","v":""},null,null,null,null,null,{"$f":"IF(E71=\"\",\"\",VLOOKUP(E71,Treinamentos!$B$13:$G$42,6,0))","v":""}]
[null,null,{"$f":"IF(B72=\"\",\"\",VLOOKUP(B72,Colab!$C$14:$E$63,2,0))","v":""},{"$f":"IF(B72=\"\",\"\",VLOOKUP(B72,Colab!$C$14:$E$63,3,0))","v":""},null,{"$f":"IF(E72=\"\",\"\",VLOOKUP(E72,Treinamentos!$B$13:$G$42,5,0))","v":""},null,null,null,null,null,{"$f":"IF(E72=\"\",\"\",VLOOKUP(E72,Treinamentos!$B$13:$G$42,6,0))","v":""}]
[null,null,{"$f":"IF(B73=\"\",\"\",VLOOKUP(B73,Colab!$C$14:$E$63,2,0))","v":""},{"$f":"IF(B73=\"\",\"\",VLOOKUP(B73,Colab!$C$14:$E$63,3,0))","v":""},null,{"$f":"IF(E73=\"\",\"\",VLOOKUP(E73,Treinamentos!$B$13:$G$42,5,0))","v":""},null,null,null,null,null,{"$f":"IF(E73=\"\",\"\",VLOOKUP(E73,Treinamentos!$B$13:$G$42,6,0))","v":""}]
[null,null,{"$f":"IF(B74=\"\",\"\",VLOOKUP(B74,Colab!$C$14:$E$63,2,0))","v":""},{"$f":"IF(B74=\"\",\"\",VLOOKUP(B74,Colab!$C$14:$E$63,3,0))","v":""},null,{"$f":"IF(E74=\"\",\"\",VLOOKUP(E74,Treinamentos!$B$13:$G$42,5,0))","v":""},null,null,null,null,null,{"$f":"IF(E74=\"\",\"\",VLOOKUP(E74,Treinamentos!$B$13:$G$42,6,0))","v":""}]
[null,null,{"$f":"IF(B75=\"\",\"\",VLOOKUP(B75,Colab!$C$14:$E$63,2,0))","v":""},{"$f":"IF(B75=\"\",\"\",VLOOKUP(B75,Colab!$C$14:$E$63,3,0))","v":""},null,{"$f":"IF(E75=\"\",\"\",VLOOKUP(E75,Treinamentos!$B$13:$G$42,5,0))","v":""},null,null,null,null,null,{"$f":"IF(E75=\"\",\"\",VLOOKUP(E75,Treinamentos!$B$13:$G$42,6,0))","v":""}]
[null,null,{"$f":"IF(B76=\"\",\"\",VLOOKUP(B76,Colab!$C$14:$E$63,2,0))","v":""},{"$f":"IF(B76=\"\",\"\",VLOOKUP(B76,Colab!$C$14:$E$63,3,0))","v":""},null,{"$f":"IF(E76=\"\",\"\",VLOOKUP(E76,Treinamentos!$B$13:$G$42,5,0))","v":""},null,null,null,null,null,{"$f":"IF(E76=\"\",\"\",VLOOKUP(E76,Treinamentos!$B$13:$G$42,6,0))","v":""}]
[null,null,{"$f":"IF(B77=\"\",\"\",VLOOKUP(B77,Colab!$C$14:$E$63,2,0))","v":""},{"$f":"IF(B77=\"\",\"\",VLOOKUP(B77,Colab!$C$14:$E$63,3,0))","v":""},null,{"$f":"IF(E77=\"\",\"\",VLOOKUP(E77,Treinamentos!$B$13:$G$42,5,0))","v":""},null,null,null,null,null,{"$f":"IF(E77=\"\",\"\",VLOOKUP(E77,Treinamentos!$B$13:$G$42,6,0))","v":""}]
[null,null,{"$f":"IF(B78=\"\",\"\",VLOOKUP(B78,Colab!$C$14:$E$63,2,0))","v":""},{"$f":"IF(B78=\"\",\"\",VLOOKUP(B78,Colab!$C$14:$E$63,3,0))","v":""},null,{"$f":"IF(E78=\"\",\"\",VLOOKUP(E78,Treinamentos!$B$13:$G$42,5,0))","v":""},null,null,null,null,null,{"$f":"IF(E78=\"\",\"\",VLOOKUP(E78,Treinamentos!$B$13:$G$42,6,0))","v":""}]
[null,null,{"$f":"IF(B79=\"\",\"\",VLOOKUP(B79,Colab!$C$14:$E$63,2,0))","v":""},{"$f":"IF(B79=\"\",\"\",VLOOKUP(B79,Colab!$C$14:$E$63,3,0))","v":""},null,{"$f":"IF(E79=\"\",\"\",VLOOKUP(E79,Treinamentos!$B$13:$G$42,5,0))","v":""},null,null,null,null,null,{"$f":"IF(E79=\"\",\"\",VLOOKUP(E79,Treinamentos!$B$13:$G$42,6,0))","v":""}]
[null,null,{"$f":"IF(B80=\"\",\"\",VLOOKUP(B80,Colab!$C$14:$E$63,2,0))","v":""},{"$f":"IF(B80=\"\",\"\",VLOOKUP(B80,Colab!$C$14:$E$63,3,0))","v":""},null,{"$f":"IF(E80=\"\",\"\",VLOOKUP(E80,Treinamentos!$B$13:$G$42,5,0))","v":""},null,null,null,null,null,{"$f":"IF(E80=\"\",\"\",VLOOKUP(E80,Treinamentos!$B$13:$G$42,6,0))","v":""}]
[null,null,{"$f":"IF(B81=\"\",\"\",VLOOKUP(B81,Colab!$C$14:$E$63,2,0))","v":""},{"$f":"IF(B81=\"\",\"\",VLOOKUP(B81,Colab!$C$14:$E$63,3,0))","v":""},null,{"$f":"IF(E81=\"\",\"\",VLOOKUP(E81,Treinamentos!$B$13:$G$42,5,0))","v":""},null,null,null,null,null,{"$f":"IF(E81=\"\",\"\",VLOOKUP(E81,Treinamentos!$B$13:$G$42,6,0))","v":""}]
[null,null,{"$f":"IF(B82=\"\",\"\",VLOOKUP(B82,Colab!$C$14:$E$63,2,0))","v":""},{"$f":"IF(B82=\"\",\"\",VLOOKUP(B82,Colab!$C$14:$E$63,3,0))","v":""},null,{"$f":"IF(E82=\"\",\"\",VLOOKUP(E82,Treinamentos!$B$13:$G$42,5,0))","v":""},null,null,null,null,null,{"$f":"IF(E82=\"\",\"\",VLOOKUP(E82,Treinamentos!$B$13:$G$42,6,0))","v":""}]
[null,null,{"$f":"IF(B83=\"\",\"\",VLOOKUP(B83,Colab!$C$14:$E$63,2,0))","v":""},{"$f":"IF(B83=\"\",\"\",VLOOKUP(B83,Colab!$C$14:$E$63,3,0))","v":""},null,{"$f":"IF(E83=\"\",\"\",VLOOKUP(E83,Treinamentos!$B$13:$G$42,5,0))","v":""},null,null,null,null,null,{"$f":"IF(E83=\"\",\"\",VLOOKUP(E83,Treinamentos!$B$13:$G$42,6,0))","v":""}]
[null,null,{"$f":"IF(B84=\"\",\"\",VLOOKUP(B84,Colab!$C$14:$E$63,2,0))","v":""},{"$f":"IF(B84=\"\",\"\",VLOOKUP(B84,Colab!$C$14:$E$63,3,0))","v":""},null,{"$f":"IF(E84=\"\",\"\",VLOOKUP(E84,Treinamentos!$B$13:$G$42,5,0))","v":""},null,null,null,null,null,{"$f":"IF(E84=\"\",\"\",VLOOKUP(E84,Treinamentos!$B$13:$G$42,6,0))","v":""}]
[null,null,{"$f":"IF(B85=\"\",\"\",VLOOKUP(B85,Colab!$C$14:$E$63,2,0))","v":""},{"$f":"IF(B85=\"\",\"\",VLOOKUP(B85,Colab!$C$14:$E$63,3,0))","v":""},null,{"$f":"IF(E85=\"\",\"\",VLOOKUP(E85,Treinamentos!$B$13:$G$42,5,0))","v":""},null,null,null,null,null,{"$f":"IF(E85=\"\",\"\",VLOOKUP(E85,Treinamentos!$B$13:$G$42,6,0))","v":""}]
[null,null,{"$f":"IF(B86=\"\",\"\",VLOOKUP(B86,Colab!$C$14:$E$63,2,0))","v":""},{"$f":"IF(B86=\"\",\"\",VLOOKUP(B86,Colab!$C$14:$E$63,3,0))","v":""},null,{"$f":"IF(E86=\"\",\"\",VLOOKUP(E86,Treinamentos!$B$13:$G$42,5,0))","v":""},null,null,null,null,null,{"$f":"IF(E86=\"\",\"\",VLOOKUP(E86,Treinamentos!$B$13:$G$42,6,0))","v":""}]
[null,null,{"$f":"IF(B87=\"\",\"\",VLOOKUP(B87,Colab!$C$14:$E$63,2,0))","v":""},{"$f":"IF(B87=\"\",\"\",VLOOKUP(B87,Colab!$C$14:$E$63,3,0))","v":""},null,{"$f":"IF(E87=\"\",\"\",VLOOKUP(E87,Treinamentos!$B$13:$G$42,5,0))","v":""},null,null,null,null,null,{"$f":"IF(E87=\"\",\"\",VLOOKUP(E87,Treinamentos!$B$13:$G$42,6,0))","v":""}]
[null,null,{"$f":"IF(B88=\"\",\"\",VLOOKUP(B88,Colab!$C$14:$E$63,2,0))","v":""},{"$f":"IF(B88=\"\",\"\",VLOOKUP(B88,Colab!$C$14:$E$63,3,0))","v":""},null,{"$f":"IF(E88=\"\",\"\",VLOOKUP(E88,Treinamentos!$B$13:$G$42,5,0))","v":""},null,null,null,null,null,{"$f":"IF(E88=\"\",\"\",VLOOKUP(E88,Treinamentos!$B$13:$G$42,6,0))","v":""}]
[null,null,{"$f":"IF(B89=\"\",\"\",VLOOKUP(B89,Colab!$C$14:$E$63,2,0))","v":""},{"$f":"IF(B89=\"\",\"\",VLOOKUP(B89,Colab!$C$14:$E$63,3,0))","v":""},null,{"$f":"IF(E89=\"\",\"\",VLOOKUP(E89,Treinamentos!$B$13:$G$42,5,0))","v":""},null,null,null,null,null,{"$f":"IF(E89=\"\",\"\",VLOOKUP(E89,Treinamentos!$B$13:$G$42,6,0))","v":""}]
[null,null,{"$f":"IF(B90=\"\",\"\",VLOOKUP(B90,Colab!$C$14:$E$63,2,0))","v":""},{"$f":"IF(B90=\"\",\"\",VLOOKUP(B90,Colab!$C$14:$E$63,3,0))","v":""},null,{"$f":"IF(E90=\"\",\"\",VLOOKUP(E90,Treinamentos!$B$13:$G$42,5,0))","v":""},null,null,null,null,null,{"$f":"IF(E90=\"\",\"\",VLOOKUP(E90,Treinamentos!$B$13:$G$42,6,0))","v":""}]
[null,null,{"$f":"IF(B91=\"\",\"\",VLOOKUP(B91,Colab!$C$14:$E$63,2,0))","v":""},{"$f":"IF(B91=\"\",\"\",VLOOKUP(B91,Colab!$C$14:$E$63,3,0))","v":""},null,{"$f":"IF(E91=\"\",\"\",VLOOKUP(E91,Treinamentos!$B$13:$G$42,5,0))","v":""},null,null,null,null,null,{"$f":"IF(E91=\"\",\"\",VLOOKUP(E91,Treinamentos!$B$13:$G$42,6,0))","v":""}]
[null,null,{"$f":"IF(B92=\"\",\"\",VLOOKUP(B92,Colab!$C$14:$E$63,2,0))","v":""},{"$f":"IF(B92=\"\",\"\",VLOOKUP(B92,Colab!$C$14:$E$63,3,0))","v":""},null,{"$f":"IF(E92=\"\",\"\",VLOOKUP(E92,Treinamentos!$B$13:$G$42,5,0))","v":""},null,null,null,null,null,{"$f":"IF(E92=\"\",\"\",VLOOKUP(E92,Treinamentos!$B$13:$G$42,6,0))","v":""}]
[null,null,{"$f":"IF(B93=\"\",\"\",VLOOKUP(B93,Colab!$C$14:$E$63,2,0))","v":""},{"$f":"IF(B93=\"\",\"\",VLOOKUP(B93,Colab!$C$14:$E$63,3,0))","v":""},null,{"$f":"IF(E93=\"\",\"\",VLOOKUP(E93,Treinamentos!$B$13:$G$42,5,0))","v":""},null,null,null,null,null,{"$f":"IF(E93=\"\",\"\",VLOOKUP(E93,Treinamentos!$B$13:$G$42,6,0))","v":""}]
[null,null,{"$f":"IF(B94=\"\",\"\",VLOOKUP(B94,Colab!$C$14:$E$63,2,0))","v":""},{"$f":"IF(B94=\"\",\"\",VLOOKUP(B94,Colab!$C$14:$E$63,3,0))","v":""},null,{"$f":"IF(E94=\"\",\"\",VLOOKUP(E94,Treinamentos!$B$13:$G$42,5,0))","v":""},null,null,null,null,null,{"$f":"IF(E94=\"\",\"\",VLOOKUP(E94,Treinamentos!$B$13:$G$42,6,0))","v":""}]
[null,null,{"$f":"IF(B95=\"\",\"\",VLOOKUP(B95,Colab!$C$14:$E$63,2,0))","v":""},{"$f":"IF(B95=\"\",\"\",VLOOKUP(B95,Colab!$C$14:$E$63,3,0))","v":""},null,{"$f":"IF(E95=\"\",\"\",VLOOKUP(E95,Treinamentos!$B$13:$G$42,5,0))","v":""},null,null,null,null,null,{"$f":"IF(E95=\"\",\"\",VLOOKUP(E95,Treinamentos!$B$13:$G$42,6,0))","v":""}]
[null,null,{"$f":"IF(B96=\"\",\"\",VLOOKUP(B96,Colab!$C$14:$E$63,2,0))","v":""},{"$f":"IF(B96=\"\",\"\",VLOOKUP(B96,Colab!$C$14:$E$63,3,0))","v":""},null,{"$f":"IF(E96=\"\",\"\",VLOOKUP(E96,Treinamentos!$B$13:$G$42,5,0))","v":""},null,null,null,null,null,{"$f":"IF(E96=\"\",\"\",VLOOKUP(E96,Treinamentos!$B$13:$G$42,6,0))","v":""}]
[null,null,{"$f":"IF(B97=\"\",\"\",VLOOKUP(B97,Colab!$C$14:$E$63,2,0))","v":""},{"$f":"IF(B97=\"\",\"\",VLOOKUP(B97,Colab!$C$14:$E$63,3,0))","v":""},null,{"$f":"IF(E97=\"\",\"\",VLOOKUP(E97,Treinamentos!$B$13:$G$42,5,0))","v":""},null,null,null,null,null,{"$f":"IF(E97=\"\",\"\",VLOOKUP(E97,Treinamentos!$B$13:$G$42,6,0))","v":""}]
[null,null,{"$f":"IF(B98=\"\",\"\",VLOOKUP(B98,Colab!$C$14:$E$63,2,0))","v":""},{"$f":"IF(B98=\"\",\"\",VLOOKUP(B98,Colab!$C$14:$E$63,3,0))","v":""},null,{"$f":"IF(E98=\"\",\"\",VLOOKUP(E98,Treinamentos!$B$13:$G$42,5,0))","v":""},null,null,null,null,null,{"$f":"IF(E98=\"\",\"\",VLOOKUP(E98,Treinamentos!$B$13:$G$42,6,0))","v":""}]
[null,null,{"$f":"IF(B99=\"\",\"\",VLOOKUP(B99,Colab!$C$14:$E$63,2,0))","v":""},{"$f":"IF(B99=\"\",\"\",VLOOKUP(B99,Colab!$C$14:$E$63,3,0))","v":""},null,{"$f":"IF(E99=\"\",\"\",VLOOKUP(E99,Treinamentos!$B$13:$G$42,5,0))","v":""},null,null,null,null,null,{"$f":"IF(E99=\"\",\"\",VLOOKUP(E99,Treinamentos!$B$13:$G$42,6,0))","v":""}]
[null,null,{"$f":"IF(B100=\"\",\"\",VLOOKUP(B100,Colab!$C$14:$E$63,2,0))","v":""},{"$f":"IF(B100=\"\",\"\",VLOOKUP(B100,Colab!$C$14:$E$63,3,0))","v":""},null,{"$f":"IF(E100=\"\",\"\",VLOOKUP(E100,Treinamentos!$B$13:$G$42,5,0))","v":""},null,null,null,null,null,{"$f":"IF(E100=\"\",\"\",VLOOKUP(E100,Treinamentos!$B$13:$G$42,6,0))","v":""}]
[null,null,{"$f":"IF(B101=\"\",\"\",VLOOKUP(B101,Colab!$C$14:$E$63,2,0))","v":""},{"$f":"IF(B101=\"\",\"\",VLOOKUP(B101,Colab!$C$14:$E$63,3,0))","v":""},null,{"$f":"IF(E101=\"\",\"\",VLOOKUP(E101,Treinamentos!$B$13:$G$42,5,0))","v":""},null,null,null,null,null,{"$f":"IF(E101=\"\",\"\",VLOOKUP(E101,Treinamentos!$B$13:$G$42,6,0))","v":""}]
[null,null,{"$f":"IF(B102=\"\",\"\",VLOOKUP(B102,Colab!$C$14:$E$63,2,0))","v":""},{"$f":"IF(B102=\"\",\"\",VLOOKUP(B102,Colab!$C$14:$E$63,3,0))","v":""},null,{"$f":"IF(E102=\"\",\"\",VLOOKUP(E102,Treinamentos!$B$13:$G$42,5,0))","v":""},null,null,null,null,null,{"$f":"IF(E102=\"\",\"\",VLOOKUP(E102,Treinamentos!$B$13:$G$42,6,0))","v":""}]
[null,null,{"$f":"IF(B103=\"\",\"\",VLOOKUP(B103,Colab!$C$14:$E$63,2,0))","v":""},{"$f":"IF(B103=\"\",\"\",VLOOKUP(B103,Colab!$C$14:$E$63,3,0))","v":""},null,{"$f":"IF(E103=\"\",\"\",VLOOKUP(E103,Treinamentos!$B$13:$G$42,5,0))","v":""},null,null,null,null,null,{"$f":"IF(E103=\"\",\"\",VLOOKUP(E103,Treinamentos!$B$13:$G$42,6,0))","v":""}]
[null,null,{"$f":"IF(B104=\"\",\"\",VLOOKUP(B104,Colab!$C$14:$E$63,2,0))","v":""},{"$f":"IF(B104=\"\",\"\",VLOOKUP(B104,Colab!$C$14:$E$63,3,0))","v":""},null,{"$f":"IF(E104=\"\",\"\",VLOOKUP(E104,Treinamentos!$B$13:$G$42,5,0))","v":""},null,null,null,null,null,{"$f":"IF(E104=\"\",\"\",VLOOKUP(E104,Treinamentos!$B$13:$G$42,6,0))","v":""}]
[null,null,{"$f":"IF(B105=\"\",\"\",VLOOKUP(B105,Colab!$C$14:$E$63,2,0))","v":""},{"$f":"IF(B105=\"\",\"\",VLOOKUP(B105,Colab!$C$14:$E$63,3,0))","v":""},null,{"$f":"IF(E105=\"\",\"\",VLOOKUP(E105,Treinamentos!$B$13:$G$42,5,0))","v":""},null,null,null,null,null,{"$f":"IF(E105=\"\",\"\",VLOOKUP(E105,Treinamentos!$B$13:$G$42,6,0))","v":""}]
[null,null,{"$f":"IF(B106=\"\",\"\",VLOOKUP(B106,Colab!$C$14:$E$63,2,0))","v":""},{"$f":"IF(B106=\"\",\"\",VLOOKUP(B106,Colab!$C$14:$E$63,3,0))","v":""},null,{"$f":"IF(E106=\"\",\"\",VLOOKUP(E106,Treinamentos!$B$13:$G$42,5,0))","v":""},null,null,null,null,null,{"$f":"IF(E106=\"\",\"\",VLOOKUP(E106,Treinamentos!$B$13:$G$42,6,0))","v":""}]
[null,null,{"$f":"IF(B107=\"\",\"\",VLOOKUP(B107,Colab!$C$14:$E$63,2,0))","v":""},{"$f":"IF(B107=\"\",\"\",VLOOKUP(B107,Colab!$C$14:$E$63,3,0))","v":""},null,{"$f":"IF(E107=\"\",\"\",VLOOKUP(E107,Treinamentos!$B$13:$G$42,5,0))","v":""},null,null,null,null,null,{"$f":"IF(E107=\"\",\"\",VLOOKUP(E107,Treinamentos!$B$13:$G$42,6,0))","v":""}]
[null,null,{"$f":"IF(B108=\"\",\"\",VLOOKUP(B108,Colab!$C$14:$E$63,2,0))","v":""},{"$f":"IF(B108=\"\",\"\",VLOOKUP(B108,Colab!$C$14:$E$63,3,0))","v":""},null,{"$f":"IF(E108=\"\",\"\",VLOOKUP(E108,Treinamentos!$B$13:$G$42,5,0))","v":""},null,null,null,null,null,{"$f":"IF(E108=\"\",\"\",VLOOKUP(E108,Treinamentos!$B$13:$G$42,6,0))","v":""}]
[null,null,{"$f":"IF(B109=\"\",\"\",VLOOKUP(B109,Colab!$C$14:$E$63,2,0))","v":""},{"$f":"IF(B109=\"\",\"\",VLOOKUP(B109,Colab!$C$14:$E$63,3,0))","v":""},null,{"$f":"IF(E109=\"\",\"\",VLOOKUP(E109,Treinamentos!$B$13:$G$42,5,0))","v":""},null,null,null,null,null,{"$f":"IF(E109=\"\",\"\",VLOOKUP(E109,Treinamentos!$B$13:$G$42,6,0))","v":""}]
[null,null,{"$f":"IF(B110=\"\",\"\",VLOOKUP(B110,Colab!$C$14:$E$63,2,0))","v":""},{"$f":"IF(B110=\"\",\"\",VLOOKUP(B110,Colab!$C$14:$E$63,3,0))","v":""},null,{"$f":"IF(E110=\"\",\"\",VLOOKUP(E110,Treinamentos!$B$13:$G$42,5,0))","v":""},null,null,null,null,null,{"$f":"IF(E110=\"\",\"\",VLOOKUP(E110,Treinamentos!$B$13:$G$42,6,0))","v":""}]
[null,null,{"$f":"IF(B111=\"\",\"\",VLOOKUP(B111,Colab!$C$14:$E$63,2,0))","v":""},{"$f":"IF(B111=\"\",\"\",VLOOKUP(B111,Colab!$C$14:$E$63,3,0))","v":""},null,{"$f":"IF(E111=\"\",\"\",VLOOKUP(E111,Treinamentos!$B$13:$G$42,5,0))","v":""},null,null,null,null,null,{"$f":"IF(E111=\"\",\"\",VLOOKUP(E111,Treinamentos!$B$13:$G$42,6,0))","v":""}]
[null,null,{"$f":"IF(B112=\"\",\"\",VLOOKUP(B112,Colab!$C$14:$E$63,2,0))","v":""},{"$f":"IF(B112=\"\",\"\",VLOOKUP(B112,Colab!$C$14:$E$63,3,0))","v":""},null,{"$f":"IF(E112=\"\",\"\",VLOOKUP(E112,Treinamentos!$B$13:$G$42,5,0))","v":""},null,null,null,null,null,{"$f":"IF(E112=\"\",\"\",VLOOKUP(E112,Treinamentos!$B$13:$G$42,6,0))","v":""}]
[null,null,{"$f":"IF(B113=\"\",\"\",VLOOKUP(B113,Colab!$C$14:$E$63,2,0))","v":""},{"$f":"IF(B113=\"\",\"\",VLOOKUP(B113,Colab!$C$14:$E$63,3,0))","v":""},null,{"$f":"IF(E113=\"\",\"\",VLOOKUP(E113,Treinamentos!$B$13:$G$42,5,0))","v":""},null,null,null,null,null,{"$f":"IF(E113=\"\",\"\",VLOOKUP(E113,Treinamentos!$B$13:$G$42,6,0))","v":""}]
[null,null,{"$f":"IF(B114=\"\",\"\",VLOOKUP(B114,Colab!$C$14:$E$63,2,0))","v":""},{"$f":"IF(B114=\"\",\"\",VLOOKUP(B114,Colab!$C$14:$E$63,3,0))","v":""},null,{"$f":"IF(E114=\"\",\"\",VLOOKUP(E114,Treinamentos!$B$13:$G$42,5,0))","v":""},null,null,null,null,null,{"$f":"IF(E114=\"\",\"\",VLOOKUP(E114,Treinamentos!$B$13:$G$42,6,0))","v":""}]
[null,null,{"$f":"IF(B115=\"\",\"\",VLOOKUP(B115,Colab!$C$14:$E$63,2,0))","v":""},{"$f":"IF(B115=\"\",\"\",VLOOKUP(B115,Colab!$C$14:$E$63,3,0))","v":""},null,{"$f":"IF(E115=\"\",\"\",VLOOKUP(E115,Treinamentos!$B$13:$G$42,5,0))","v":""},null,null,null,null,null,{"$f":"IF(E115=\"\",\"\",VLOOKUP(E115,Treinamentos!$B$13:$G$42,6,0))","v":""}]
[null,null,{"$f":"IF(B116=\"\",\"\",VLOOKUP(B116,Colab!$C$14:$E$63,2,0))","v":""},{"$f":"IF(B116=\"\",\"\",VLOOKUP(B116,Colab!$C$14:$E$63,3,0))","v":""},null,{"$f":"IF(E116=\"\",\"\",VLOOKUP(E116,Treinamentos!$B$13:$G$42,5,0))","v":""},null,null,null,null,null,{"$f":"IF(E116=\"\",\"\",VLOOKUP(E116,Treinamentos!$B$13:$G$42,6,0))","v":""}]
[null,null,{"$f":"IF(B117=\"\",\"\",VLOOKUP(B117,Colab!$C$14:$E$63,2,0))","v":""},{"$f":"IF(B117=\"\",\"\",VLOOKUP(B117,Colab!$C$14:$E$63,3,0))","v":""},null,{"$f":"IF(E117=\"\",\"\",VLOOKUP(E117,Treinamentos!$B$13:$G$42,5,0))","v":""},null,null,null,null,null,{"$f":"IF(E117=\"\",\"\",VLOOKUP(E117,Treinamentos!$B$13:$G$42,6,0))","v":""}]
[null,null,{"$f":"IF(B118=\"\",\"\",VLOOKUP(B118,Colab!$C$14:$E$63,2,0))","v":""},{"$f":"IF(B118=\"\",\"\",VLOOKUP(B118,Colab!$C$14:$E$63,3,0))","v":""},null,{"$f":"IF(E118=\"\",\"\",VLOOKUP(E118,Treinamentos!$B$13:$G$42,5,0))","v":""},null,null,null,null,null,{"$f":"IF(E118=\"\",\"\",VLOOKUP(E118,Treinamentos!$B$13:$G$42,6,0))","v":""}]
[null,null,{"$f":"IF(B119=\"\",\"\",VLOOKUP(B119,Colab!$C$14:$E$63,2,0))","v":""},{"$f":"IF(B119=\"\",\"\",VLOOKUP(B119,Colab!$C$14:$E$63,3,0))","v":""},null,{"$f":"IF(E119=\"\",\"\",VLOOKUP(E119,Treinamentos!$B$13:$G$42,5,0))","v":""},null,null,null,null,null,{"$f":"IF(E119=\"\",\"\",VLOOKUP(E119,Treinamentos!$B$13:$G$42,6,0))","v":""}]
[null,null,{"$f":"IF(B120=\"\",\"\",VLOOKUP(B120,Colab!$C$14:$E$63,2,0))","v":""},{"$f":"IF(B120=\"\",\"\",VLOOKUP(B120,Colab!$C$14:$E$63,3,0))","v":""},null,{"$f":"IF(E120=\"\",\"\",VLOOKUP(E120,Treinamentos!$B$13:$G$42,5,0))","v":""},null,null,null,null,null,{"$f":"IF(E120=\"\",\"\",VLOOKUP(E120,Treinamentos!$B$13:$G$42,6,0))","v":""}]
[null,null,{"$f":"IF(B121=\"\",\"\",VLOOKUP(B121,Colab!$C$14:$E$63,2,0))","v":""},{"$f":"IF(B121=\"\",\"\",VLOOKUP(B121,Colab!$C$14:$E$63,3,0))","v":""},null,{"$f":"IF(E121=\"\",\"\",VLOOKUP(E121,Treinamentos!$B$13:$G$42,5,0))","v":""},null,null,null,null,null,{"$f":"IF(E121=\"\",\"\",VLOOKUP(E121,Treinamentos!$B$13:$G$42,6,0))","v":""}]
[null,null,{"$f":"IF(B122=\"\",\"\",VLOOKUP(B122,Colab!$C$14:$E$63,2,0))","v":""},{"$f":"IF(B122=\"\",\"\",VLOOKUP(B122,Colab!$C$14:$E$63,3,0))","v":""},null,{"$f":"IF(E122=\"\",\"\",VLOOKUP(E122,Treinamentos!$B$13:$G$42,5,0))","v":""},null,null,null,null,null,{"$f":"IF(E122=\"\",\"\",VLOOKUP(E122,Treinamentos!$B$13:$G$42,6,0))","v":""}]
[null,null,{"$f":"IF(B123=\"\",\"\",VLOOKUP(B123,Colab!$C$14:$E$63,2,0))","v":""},{"$f":"IF(B123=\"\",\"\",VLOOKUP(B123,Colab!$C$14:$E$63,3,0))","v":""},null,{"$f":"IF(E123=\"\",\"\",VLOOKUP(E123,Treinamentos!$B$13:$G$42,5,0))","v":""},null,null,null,null,null,{"$f":"IF(E123=\"\",\"\",VLOOKUP(E123,Treinamentos!$B$13:$G$42,6,0))","v":""}]
[null,null,{"$f":"IF(B124=\"\",\"\",VLOOKUP(B124,Colab!$C$14:$E$63,2,0))","v":""},{"$f":"IF(B124=\"\",\"\",VLOOKUP(B124,Colab!$C$14:$E$63,3,0))","v":""},null,{"$f":"IF(E124=\"\",\"\",VLOOKUP(E124,Treinamentos!$B$13:$G$42,5,0))","v":""},null,null,null,null,null,{"$f":"IF(E124=\"\",\"\",VLOOKUP(E124,Treinamentos!$B$13:$G$42,6,0))","v":""}]
[null,null,{"$f":"IF(B125=\"\",\"\",VLOOKUP(B125,Colab!$C$14:$E$63,2,0))","v":""},{"$f":"IF(B125=\"\",\"\",VLOOKUP(B125,Colab!$C$14:$E$63,3,0))","v":""},null,{"$f":"IF(E125=\"\",\"\",VLOOKUP(E125,Treinamentos!$B$13:$G$42,5,0))","v":""},null,null,null,null,null,{"$f":"IF(E125=\"\",\"\",VLOOKUP(E125,Treinamentos!$B$13:$G$42,6,0))","v":""}]
[null,null,{"$f":"IF(B126=\"\",\"\",VLOOKUP(B126,Colab!$C$14:$E$63,2,0))","v":""},{"$f":"IF(B126=\"\",\"\",VLOOKUP(B126,Colab!$C$14:$E$63,3,0))","v":""},null,{"$f":"IF(E126=\"\",\"\",VLOOKUP(E126,Treinamentos!$B$13:$G$42,5,0))","v":""},null,null,null,null,null,{"$f":"IF(E126=\"\",\"\",VLOOKUP(E126,Treinamentos!$B$13:$G$42,6,0))","v":""}]
[null,null,{"$f":"IF(B127=\"\",\"\",VLOOKUP(B127,Colab!$C$14:$E$63,2,0))","v":""},{"$f":"IF(B127=\"\",\"\",VLOOKUP(B127,Colab!$C$14:$E$63,3,0))","v":""},null,{"$f":"IF(E127=\"\",\"\",VLOOKUP(E127,Treinamentos!$B$13:$G$42,5,0))","v":""},null,null,null,null,null,{"$f":"IF(E127=\"\",\"\",VLOOKUP(E127,Treinamentos!$B$13:$G$42,6,0))","v":""}]
[null,null,{"$f":"IF(B128=\"\",\"\",VLOOKUP(B128,Colab!$C$14:$E$63,2,0))","v":""},{"$f":"IF(B128=\"\",\"\",VLOOKUP(B128,Colab!$C$14:$E$63,3,0))","v":""},null,{"$f":"IF(E128=\"\",\"\",VLOOKUP(E128,Treinamentos!$B$13:$G$42,5,0))","v":""},null,null,null,null,null,{"$f":"IF(E128=\"\",\"\",VLOOKUP(E128,Treinamentos!$B$13:$G$42,6,0))","v":""}]
[null,null,{"$f":"IF(B129=\"\",\"\",VLOOKUP(B129,Colab!$C$14:$E$63,2,0))","v":""},{"$f":"IF(B129=\"\",\"\",VLOOKUP(B129,Colab!$C$14:$E$63,3,0))","v":""},null,{"$f":"IF(E129=\"\",\"\",VLOOKUP(E129,Treinamentos!$B$13:$G$42,5,0))","v":""},null,null,null,null,null,{"$f":"IF(E129=\"\",\"\",VLOOKUP(E129,Treinamentos!$B$13:$G$42,6,0))","v":""}]
[null,null,{"$f":"IF(B130=\"\",\"\",VLOOKUP(B130,Colab!$C$14:$E$63,2,0))","v":""},{"$f":"IF(B130=\"\",\"\",VLOOKUP(B130,Colab!$C$14:$E$63,3,0))","v":""},null,{"$f":"IF(E130=\"\",\"\",VLOOKUP(E130,Treinamentos!$B$13:$G$42,5,0))","v":""},null,null,null,null,null,{"$f":"IF(E130=\"\",\"\",VLOOKUP(E130,Treinamentos!$B$13:$G$42,6,0))","v":""}]
[null,null,{"$f":"IF(B131=\"\",\"\",VLOOKUP(B131,Colab!$C$14:$E$63,2,0))","v":""},{"$f":"IF(B131=\"\",\"\",VLOOKUP(B131,Colab!$C$14:$E$63,3,0))","v":""},null,{"$f":"IF(E131=\"\",\"\",VLOOKUP(E131,Treinamentos!$B$13:$G$42,5,0))","v":""},null,null,null,null,null,{"$f":"IF(E131=\"\",\"\",VLOOKUP(E131,Treinamentos!$B$13:$G$42,6,0))","v":""}]
[null,null,{"$f":"IF(B132=\"\",\"\",VLOOKUP(B132,Colab!$C$14:$E$63,2,0))","v":""},{"$f":"IF(B132=\"\",\"\",VLOOKUP(B132,Colab!$C$14:$E$63,3,0))","v":""},null,{"$f":"IF(E132=\"\",\"\",VLOOKUP(E132,Treinamentos!$B$13:$G$42,5,0))","v":""},null,null,null,null,null,{"$f":"IF(E132=\"\",\"\",VLOOKUP(E132,Treinamentos!$B$13:$G$42,6,0))","v":""}]
[null,null,{"$f":"IF(B133=\"\",\"\",VLOOKUP(B133,Colab!$C$14:$E$63,2,0))","v":""},{"$f":"IF(B133=\"\",\"\",VLOOKUP(B133,Colab!$C$14:$E$63,3,0))","v":""},null,{"$f":"IF(E133=\"\",\"\",VLOOKUP(E133,Treinamentos!$B$13:$G$42,5,0))","v":""},null,null,null,null,null,{"$f":"IF(E133=\"\",\"\",VLOOKUP(E133,Treinamentos!$B$13:$G$42,6,0))","v":""}]
[null,null,{"$f":"IF(B134=\"\",\"\",VLOOKUP(B134,Colab!$C$14:$E$63,2,0))","v":""},{"$f":"IF(B134=\"\",\"\",VLOOKUP(B134,Colab!$C$14:$E$63,3,0))","v":""},null,{"$f":"IF(E134=\"\",\"\",VLOOKUP(E134,Treinamentos!$B$13:$G$42,5,0))","v":""},null,null,null,null,null,{"$f":"IF(E134=\"\",\"\",VLOOKUP(E134,Treinamentos!$B$13:$G$42,6,0))","v":""}]
[null,null,{"$f":"IF(B135=\"\",\"\",VLOOKUP(B135,Colab!$C$14:$E$63,2,0))","v":""},{"$f":"IF(B135=\"\",\"\",VLOOKUP(B135,Colab!$C$14:$E$63,3,0))","v":""},null,{"$f":"IF(E135=\"\",\"\",VLOOKUP(E135,Treinamentos!$B$13:$G$42,5,0))","v":""},null,null,null,null,null,{"$f":"IF(E135=\"\",\"\",VLOOKUP(E135,Treinamentos!$B$13:$G$42,6,0))","v":""}]
[null,null,{"$f":"IF(B136=\"\",\"\",VLOOKUP(B136,Colab!$C$14:$E$63,2,0))","v":""},{"$f":"IF(B136=\"\",\"\",VLOOKUP(B136,Colab!$C$14:$E$63,3,0))","v":""},null,{"$f":"IF(E136=\"\",\"\",VLOOKUP(E136,Treinamentos!$B$13:$G$42,5,0))","v":""},null,null,null,null,null,{"$f":"IF(E136=\"\",\"\",VLOOKUP(E136,Treinamentos!$B$13:$G$42,6,0))","v":""}]
[null,null,{"$f":"IF(B137=\"\",\"\",VLOOKUP(B137,Colab!$C$14:$E$63,2,0))","v":""},{"$f":"IF(B137=\"\",\"\",VLOOKUP(B137,Colab!$C$14:$E$63,3,0))","v":""},null,{"$f":"IF(E137=\"\",\"\",VLOOKUP(E137,Treinamentos!$B$13:$G$42,5,0))","v":""},null,null,null,null,null,{"$f":"IF(E137=\"\",\"\",VLOOKUP(E137,Treinamentos!$B$13:$G$42,6,0))","v":""}]
[null,null,{"$f":"IF(B138=\"\",\"\",VLOOKUP(B138,Colab!$C$14:$E$63,2,0))","v":""},{"$f":"IF(B138=\"\",\"\",VLOOKUP(B138,Colab!$C$14:$E$63,3,0))","v":""},null,{"$f":"IF(E138=\"\",\"\",VLOOKUP(E138,Treinamentos!$B$13:$G$42,5,0))","v":""},null,null,null,null,null,{"$f":"IF(E138=\"\",\"\",VLOOKUP(E138,Treinamentos!$B$13:$G$42,6,0))","v":""}]
[null,null,{"$f":"IF(B139=\"\",\"\",VLOOKUP(B139,Colab!$C$14:$E$63,2,0))","v":""},{"$f":"IF(B139=\"\",\"\",VLOOKUP(B139,Colab!$C$14:$E$63,3,0))","v":""},null,{"$f":"IF(E139=\"\",\"\",VLOOKUP(E139,Treinamentos!$B$13:$G$42,5,0))","v":""},null,null,null,null,null,{"$f":"IF(E139=\"\",\"\",VLOOKUP(E139,Treinamentos!$B$13:$G$42,6,0))","v":""}]
[null,null,{"$f":"IF(B140=\"\",\"\",VLOOKUP(B140,Colab!$C$14:$E$63,2,0))","v":""},{"$f":"IF(B140=\"\",\"\",VLOOKUP(B140,Colab!$C$14:$E$63,3,0))","v":""},null,{"$f":"IF(E140=\"\",\"\",VLOOKUP(E140,Treinamentos!$B$13:$G$42,5,0))","v":""},null,null,null,null,null,{"$f":"IF(E140=\"\",\"\",VLOOKUP(E140,Treinamentos!$B$13:$G$42,6,0))","v":""}]
[null,null,{"$f":"IF(B141=\"\",\"\",VLOOKUP(B141,Colab!$C$14:$E$63,2,0))","v":""},{"$f":"IF(B141=\"\",\"\",VLOOKUP(B141,Colab!$C$14:$E$63,3,0))","v":""},null,{"$f":"IF(E141=\"\",\"\",VLOOKUP(E141,Treinamentos!$B$13:$G$42,5,0))","v":""},null,null,null,null,null,{"$f":"IF(E141=\"\",\"\",VLOOKUP(E141,Treinamentos!$B$13:$G$42,6,0))","v":""}]
[null,null,{"$f":"IF(B142=\"\",\"\",VLOOKUP(B142,Colab!$C$14:$E$63,2,0))","v":""},{"$f":"IF(B142=\"\",\"\",VLOOKUP(B142,Colab!$C$14:$E$63,3,0))","v":""},null,{"$f":"IF(E142=\"\",\"\",VLOOKUP(E142,Treinamentos!$B$13:$G$42,5,0))","v":""},null,null,null,null,null,{"$f":"IF(E142=\"\",\"\",VLOOKUP(E142,Treinamentos!$B$13:$G$42,6,0))","v":""}]
[null,null,{"$f":"IF(B143=\"\",\"\",VLOOKUP(B143,Colab!$C$14:$E$63,2,0))","v":""},{"$f":"IF(B143=\"\",\"\",VLOOKUP(B143,Colab!$C$14:$E$63,3,0))","v":""},null,{"$f":"IF(E143=\"\",\"\",VLOOKUP(E143,Treinamentos!$B$13:$G$42,5,0))","v":""},null,null,null,null,null,{"$f":"IF(E143=\"\",\"\",VLOOKUP(E143,Treinamentos!$B$13:$G$42,6,0))","v":""}]
[null,null,{"$f":"IF(B144=\"\",\"\",VLOOKUP(B144,Colab!$C$14:$E$63,2,0))","v":""},{"$f":"IF(B144=\"\",\"\",VLOOKUP(B144,Colab!$C$14:$E$63,3,0))","v":""},null,{"$f":"IF(E144=\"\",\"\",VLOOKUP(E144,Treinamentos!$B$13:$G$42,5,0))","v":""},null,null,null,null,null,{"$f":"IF(E144=\"\",\"\",VLOOKUP(E144,Treinamentos!$B$13:$G$42,6,0))","v":""}]
[null,null,{"$f":"IF(B145=\"\",\"\",VLOOKUP(B145,Colab!$C$14:$E$63,2,0))","v":""},{"$f":"IF(B145=\"\",\"\",VLOOKUP(B145,Colab!$C$14:$E$63,3,0))","v":""},null,{"$f":"IF(E145=\"\",\"\",VLOOKUP(E145,Treinamentos!$B$13:$G$42,5,0))","v":""},null,null,null,null,null,{"$f":"IF(E145=\"\",\"\",VLOOKUP(E145,Treinamentos!$B$13:$G$42,6,0))","v":""}]
[null,null,{"$f":"IF(B146=\"\",\"\",VLOOKUP(B146,Colab!$C$14:$E$63,2,0))","v":""},{"$f":"IF(B146=\"\",\"\",VLOOKUP(B146,Colab!$C$14:$E$63,3,0))","v":""},null,{"$f":"IF(E146=\"\",\"\",VLOOKUP(E146,Treinamentos!$B$13:$G$42,5,0))","v":""},null,null,null,null,null,{"$f":"IF(E146=\"\",\"\",VLOOKUP(E146,Treinamentos!$B$13:$G$42,6,0))","v":""}]
[null,null,{"$f":"IF(B147=\"\",\"\",VLOOKUP(B147,Colab!$C$14:$E$63,2,0))","v":""},{"$f":"IF(B147=\"\",\"\",VLOOKUP(B147,Colab!$C$14:$E$63,3,0))","v":""},null,{"$f":"IF(E147=\"\",\"\",VLOOKUP(E147,Treinamentos!$B$13:$G$42,5,0))","v":""},null,null,null,null,null,{"$f":"IF(E147=\"\",\"\",VLOOKUP(E147,Treinamentos!$B$13:$G$42,6,0))","v":""}]
[null,null,{"$f":"IF(B148=\"\",\"\",VLOOKUP(B148,Colab!$C$14:$E$63,2,0))","v":""},{"$f":"IF(B148=\"\",\"\",VLOOKUP(B148,Colab!$C$14:$E$63,3,0))","v":""},null,{"$f":"IF(E148=\"\",\"\",VLOOKUP(E148,Treinamentos!$B$13:$G$42,5,0))","v":""},null,null,null,null,null,{"$f":"IF(E148=\"\",\"\",VLOOKUP(E148,Treinamentos!$B$13:$G$42,6,0))","v":""}]
[null,null,{"$f":"IF(B149=\"\",\"\",VLOOKUP(B149,Colab!$C$14:$E$63,2,0))","v":""},{"$f":"IF(B149=\"\",\"\",VLOOKUP(B149,Colab!$C$14:$E$63,3,0))","v":""},null,{"$f":"IF(E149=\"\",\"\",VLOOKUP(E149,Treinamentos!$B$13:$G$42,5,0))","v":""},null,null,null,null,null,{"$f":"IF(E149=\"\",\"\",VLOOKUP(E149,Treinamentos!$B$13:$G$42,6,0))","v":""}]
[null,null,{"$f":"IF(B150=\"\",\"\",VLOOKUP(B150,Colab!$C$14:$E$63,2,0))","v":""},{"$f":"IF(B150=\"\",\"\",VLOOKUP(B150,Colab!$C$14:$E$63,3,0))","v":""},null,{"$f":"IF(E150=\"\",\"\",VLOOKUP(E150,Treinamentos!$B$13:$G$42,5,0))","v":""},null,null,null,null,null,{"$f":"IF(E150=\"\",\"\",VLOOKUP(E150,Treinamentos!$B$13:$G$42,6,0))","v":""}]
[null,null,{"$f":"IF(B151=\"\",\"\",VLOOKUP(B151,Colab!$C$14:$E$63,2,0))","v":""},{"$f":"IF(B151=\"\",\"\",VLOOKUP(B151,Colab!$C$14:$E$63,3,0))","v":""},null,{"$f":"IF(E151=\"\",\"\",VLOOKUP(E151,Treinamentos!$B$13:$G$42,5,0))","v":""},null,null,null,null,null,{"$f":"IF(E151=\"\",\"\",VLOOKUP(E151,Treinamentos!$B$13:$G$42,6,0))","v":""}]
[null,null,{"$f":"IF(B152=\"\",\"\",VLOOKUP(B152,Colab!$C$14:$E$63,2,0))","v":""},{"$f":"IF(B152=\"\",\"\",VLOOKUP(B152,Colab!$C$14:$E$63,3,0))","v":""},null,{"$f":"IF(E152=\"\",\"\",VLOOKUP(E152,Treinamentos!$B$13:$G$42,5,0))","v":""},null,null,null,null,null,{"$f":"IF(E152=\"\",\"\",VLOOKUP(E152,Treinamentos!$B$13:$G$42,6,0))","v":""}]
[null,null,{"$f":"IF(B153=\"\",\"\",VLOOKUP(B153,Colab!$C$14:$E$63,2,0))","v":""},{"$f":"IF(B153=\"\",\"\",VLOOKUP(B153,Colab!$C$14:$E$63,3,0))","v":""},null,{"$f":"IF(E153=\"\",\"\",VLOOKUP(E153,Treinamentos!$B$13:$G$42,5,0))","v":""},null,null,null,null,null,{"$f":"IF(E153=\"\",\"\",VLOOKUP(E153,Treinamentos!$B$13:$G$42,6,0))","v":""}]
[null,null,{"$f":"IF(B154=\"\",\"\",VLOOKUP(B154,Colab!$C$14:$E$63,2,0))","v":""},{"$f":"IF(B154=\"\",\"\",VLOOKUP(B154,Colab!$C$14:$E$63,3,0))","v":""},null,{"$f":"IF(E154=\"\",\"\",VLOOKUP(E154,Treinamentos!$B$13:$G$42,5,0))","v":""},null,null,null,null,null,{"$f":"IF(E154=\"\",\"\",VLOOKUP(E154,Treinamentos!$B$13:$G$42,6,0))","v":""}]
[null,null,{"$f":"IF(B155=\"\",\"\",VLOOKUP(B155,Colab!$C$14:$E$63,2,0))","v":""},{"$f":"IF(B155=\"\",\"\",VLOOKUP(B155,Colab!$C$14:$E$63,3,0))","v":""},null,{"$f":"IF(E155=\"\",\"\",VLOOKUP(E155,Treinamentos!$B$13:$G$42,5,0))","v":""},null,null,null,null,null,{"$f":"IF(E155=\"\",\"\",VLOOKUP(E155,Treinamentos!$B$13:$G$42,6,0))","v":""}]
[null,null,{"$f":"IF(B156=\"\",\"\",VLOOKUP(B156,Colab!$C$14:$E$63,2,0))","v":""},{"$f":"IF(B156=\"\",\"\",VLOOKUP(B156,Colab!$C$14:$E$63,3,0))","v":""},null,{"$f":"IF(E156=\"\",\"\",VLOOKUP(E156,Treinamentos!$B$13:$G$42,5,0))","v":""},null,null,null,null,null,{"$f":"IF(E156=\"\",\"\",VLOOKUP(E156,Treinamentos!$B$13:$G$42,6,0))","v":""}]
[null,null,{"$f":"IF(B157=\"\",\"\",VLOOKUP(B157,Colab!$C$14:$E$63,2,0))","v":""},{"$f":"IF(B157=\"\",\"\",VLOOKUP(B157,Colab!$C$14:$E$63,3,0))","v":""},null,{"$f":"IF(E157=\"\",\"\",VLOOKUP(E157,Treinamentos!$B$13:$G$42,5,0))","v":""},null,null,null,null,null,{"$f":"IF(E157=\"\",\"\",VLOOKUP(E157,Treinamentos!$B$13:$G$42,6,0))","v":""}]
[null,null,{"$f":"IF(B158=\"\",\"\",VLOOKUP(B158,Colab!$C$14:$E$63,2,0))","v":""},{"$f":"IF(B158=\"\",\"\",VLOOKUP(B158,Colab!$C$14:$E$63,3,0))","v":""},null,{"$f":"IF(E158=\"\",\"\",VLOOKUP(E158,Treinamentos!$B$13:$G$42,5,0))","v":""},null,null,null,null,null,{"$f":"IF(E158=\"\",\"\",VLOOKUP(E158,Treinamentos!$B$13:$G$42,6,0))","v":""}]
[null,null,{"$f":"IF(B159=\"\",\"\",VLOOKUP(B159,Colab!$C$14:$E$63,2,0))","v":""},{"$f":"IF(B159=\"\",\"\",VLOOKUP(B159,Colab!$C$14:$E$63,3,0))","v":""},null,{"$f":"IF(E159=\"\",\"\",VLOOKUP(E159,Treinamentos!$B$13:$G$42,5,0))","v":""},null,null,null,null,null,{"$f":"IF(E159=\"\",\"\",VLOOKUP(E159,Treinamentos!$B$13:$G$42,6,0))","v":""}]
[null,null,{"$f":"IF(B160=\"\",\"\",VLOOKUP(B160,Colab!$C$14:$E$63,2,0))","v":""},{"$f":"IF(B160=\"\",\"\",VLOOKUP(B160,Colab!$C$14:$E$63,3,0))","v":""},null,{"$f":"IF(E160=\"\",\"\",VLOOKUP(E160,Treinamentos!$B$13:$G$42,5,0))","v":""},null,null,null,null,null,{"$f":"IF(E160=\"\",\"\",VLOOKUP(E160,Treinamentos!$B$13:$G$42,6,0))","v":""}]
[null,null,{"$f":"IF(B161=\"\",\"\",VLOOKUP(B161,Colab!$C$14:$E$63,2,0))","v":""},{"$f":"IF(B161=\"\",\"\",VLOOKUP(B161,Colab!$C$14:$E$63,3,0))","v":""},null,{"$f":"IF(E161=\"\",\"\",VLOOKUP(E161,Treinamentos!$B$13:$G$42,5,0))","v":""},null,null,null,null,null,{"$f":"IF(E161=\"\",\"\",VLOOKUP(E161,Treinamentos!$B$13:$G$42,6,0))","v":""}]
[null,null,{"$f":"IF(B162=\"\",\"\",VLOOKUP(B162,Colab!$C$14:$E$63,2,0))","v":""},{"$f":"IF(B162=\"\",\"\",VLOOKUP(B162,Colab!$C$14:$E$63,3,0))","v":""},null,{"$f":"IF(E162=\"\",\"\",VLOOKUP(E162,Treinamentos!$B$13:$G$42,5,0))","v":""},null,null,null,null,null,{"$f":"IF(E162=\"\",\"\",VLOOKUP(E162,Treinamentos!$B$13:$G$42,6,0))","v":""}]
[null,null,{"$f":"IF(B163=\"\",\"\",VLOOKUP(B163,Colab!$C$14:$E$63,2,0))","v":""},{"$f":"IF(B163=\"\",\"\",VLOOKUP(B163,Colab!$C$14:$E$63,3,0))","v":""},null,{"$f":"IF(E163=\"\",\"\",VLOOKUP(E163,Treinamentos!$B$13:$G$42,5,0))","v":""},null,null,null,null,null,{"$f":"IF(E163=\"\",\"\",VLOOKUP(E163,Treinamentos!$B$13:$G$42,6,0))","v":""}]
[null,null,{"$f":"IF(B164=\"\",\"\",VLOOKUP(B164,Colab!$C$14:$E$63,2,0))","v":""},{"$f":"IF(B164=\"\",\"\",VLOOKUP(B164,Colab!$C$14:$E$63,3,0))","v":""},null,{"$f":"IF(E164=\"\",\"\",VLOOKUP(E164,Treinamentos!$B$13:$G$42,5,0))","v":""},null,null,null,null,null,{"$f":"IF(E164=\"\",\"\",VLOOKUP(E164,Treinamentos!$B$13:$G$42,6,0))","v":""}]
[null,null,{"$f":"IF(B165=\"\",\"\",VLOOKUP(B165,Colab!$C$14:$E$63,2,0))","v":""},{"$f":"IF(B165=\"\",\"\",VLOOKUP(B165,Colab!$C$14:$E$63,3,0))","v":""},null,{"$f":"IF(E165=\"\",\"\",VLOOKUP(E165,Treinamentos!$B$13:$G$42,5,0))","v":""},null,null,null,null,null,{"$f":"IF(E165=\"\",\"\",VLOOKUP(E165,Treinamentos!$B$13:$G$42,6,0))","v":""}]
[null,null,{"$f":"IF(B166=\"\",\"\",VLOOKUP(B166,Colab!$C$14:$E$63,2,0))","v":""},{"$f":"IF(B166=\"\",\"\",VLOOKUP(B166,Colab!$C$14:$E$63,3,0))","v":""},null,{"$f":"IF(E166=\"\",\"\",VLOOKUP(E166,Treinamentos!$B$13:$G$42,5,0))","v":""},null,null,null,null,null,{"$f":"IF(E166=\"\",\"\",VLOOKUP(E166,Treinamentos!$B$13:$G$42,6,0))","v":""}]
[null,null,{"$f":"IF(B167=\"\",\"\",VLOOKUP(B167,Colab!$C$14:$E$63,2,0))","v":""},{"$f":"IF(B167=\"\",\"\",VLOOKUP(B167,Colab!$C$14:$E$63,3,0))","v":""},null,{"$f":"IF(E167=\"\",\"\",VLOOKUP(E167,Treinamentos!$B$13:$G$42,5,0))","v":""},null,null,null,null,null,{"$f":"IF(E167=\"\",\"\",VLOOKUP(E167,Treinamentos!$B$13:$G$42,6,0))","v":""}]
[null,null,{"$f":"IF(B168=\"\",\"\",VLOOKUP(B168,Colab!$C$14:$E$63,2,0))","v":""},{"$f":"IF(B168=\"\",\"\",VLOOKUP(B168,Colab!$C$14:$E$63,3,0))","v":""},null,{"$f":"IF(E168=\"\",\"\",VLOOKUP(E168,Treinamentos!$B$13:$G$42,5,0))","v":""},null,null,null,null,null,{"$f":"IF(E168=\"\",\"\",VLOOKUP(E168,Treinamentos!$B$13:$G$42,6,0))","v":""}]
[null,null,{"$f":"IF(B169=\"\",\"\",VLOOKUP(B169,Colab!$C$14:$E$63,2,0))","v":""},{"$f":"IF(B169=\"\",\"\",VLOOKUP(B169,Colab!$C$14:$E$63,3,0))","v":""},null,{"$f":"IF(E169=\"\",\"\",VLOOKUP(E169,Treinamentos!$B$13:$G$42,5,0))","v":""},null,null,null,null,null,{"$f":"IF(E169=\"\",\"\",VLOOKUP(E169,Treinamentos!$B$13:$G$42,6,0))","v":""}]
[null,null,{"$f":"IF(B170=\"\",\"\",VLOOKUP(B170,Colab!$C$14:$E$63,2,0))","v":""},{"$f":"IF(B170=\"\",\"\",VLOOKUP(B170,Colab!$C$14:$E$63,3,0))","v":""},null,{"$f":"IF(E170=\"\",\"\",VLOOKUP(E170,Treinamentos!$B$13:$G$42,5,0))","v":""},null,null,null,null,null,{"$f":"IF(E170=\"\",\"\",VLOOKUP(E170,Treinamentos!$B$13:$G$42,6,0))","v":""}]
[null,null,{"$f":"IF(B171=\"\",\"\",VLOOKUP(B171,Colab!$C$14:$E$63,2,0))","v":""},{"$f":"IF(B171=\"\",\"\",VLOOKUP(B171,Colab!$C$14:$E$63,3,0))","v":""},null,{"$f":"IF(E171=\"\",\"\",VLOOKUP(E171,Treinamentos!$B$13:$G$42,5,0))","v":""},null,null,null,null,null,{"$f":"IF(E171=\"\",\"\",VLOOKUP(E171,Treinamentos!$B$13:$G$42,6,0))","v":""}]
[null,null,{"$f":"IF(B172=\"\",\"\",VLOOKUP(B172,Colab!$C$14:$E$63,2,0))","v":""},{"$f":"IF(B172=\"\",\"\",VLOOKUP(B172,Colab!$C$14:$E$63,3,0))","v":""},null,{"$f":"IF(E172=\"\",\"\",VLOOKUP(E172,Treinamentos!$B$13:$G$42,5,0))","v":""},null,null,null,null,null,{"$f":"IF(E172=\"\",\"\",VLOOKUP(E172,Treinamentos!$B$13:$G$42,6,0))","v":""}]
[null,null,{"$f":"IF(B173=\"\",\"\",VLOOKUP(B173,Colab!$C$14:$E$63,2,0))","v":""},{"$f":"IF(B173=\"\",\"\",VLOOKUP(B173,Colab!$C$14:$E$63,3,0))","v":""},null,{"$f":"IF(E173=\"\",\"\",VLOOKUP(E173,Treinamentos!$B$13:$G$42,5,0))","v":""},null,null,null,null,null,{"$f":"IF(E173=\"\",\"\",VLOOKUP(E173,Treinamentos!$B$13:$G$42,6,0))","v":""}]
[null,null,{"$f":"IF(B174=\"\",\"\",VLOOKUP(B174,Colab!$C$14:$E$63,2,0))","v":""},{"$f":"IF(B174=\"\",\"\",VLOOKUP(B174,Colab!$C$14:$E$63,3,0))","v":""},null,{"$f":"IF(E174=\"\",\"\",VLOOKUP(E174,Treinamentos!$B$13:$G$42,5,0))","v":""},null,null,null,null,null,{"$f":"IF(E174=\"\",\"\",VLOOKUP(E174,Treinamentos!$B$13:$G$42,6,0))","v":""}]
[null,null,{"$f":"IF(B175=\"\",\"\",VLOOKUP(B175,Colab!$C$14:$E$63,2,0))","v":""},{"$f":"IF(B175=\"\",\"\",VLOOKUP(B175,Colab!$C$14:$E$63,3,0))","v":""},null,{"$f":"IF(E175=\"\",\"\",VLOOKUP(E175,Treinamentos!$B$13:$G$42,5,0))","v":""},null,null,null,null,null,{"$f":"IF(E175=\"\",\"\",VLOOKUP(E175,Treinamentos!$B$13:$G$42,6,0))","v":""}]
[null,null,{"$f":"IF(B176=\"\",\"\",VLOOKUP(B176,Colab!$C$14:$E$63,2,0))","v":""},{"$f":"IF(B176=\"\",\"\",VLOOKUP(B176,Colab!$C$14:$E$63,3,0))","v":""},null,{"$f":"IF(E176=\"\",\"\",VLOOKUP(E176,Treinamentos!$B$13:$G$42,5,0))","v":""},null,null,null,null,null,{"$f":"IF(E176=\"\",\"\",VLOOKUP(E176,Treinamentos!$B$13:$G$42,6,0))","v":""}]
[null,null,{"$f":"IF(B177=\"\",\"\",VLOOKUP(B177,Colab!$C$14:$E$63,2,0))","v":""},{"$f":"IF(B177=\"\",\"\",VLOOKUP(B177,Colab!$C$14:$E$63,3,0))","v":""},null,{"$f":"IF(E177=\"\",\"\",VLOOKUP(E177,Treinamentos!$B$13:$G$42,5,0))","v":""},null,null,null,null,null,{"$f":"IF(E177=\"\",\"\",VLOOKUP(E177,Treinamentos!$B$13:$G$42,6,0))","v":""}]
[null,null,{"$f":"IF(B178=\"\",\"\",VLOOKUP(B178,Colab!$C$14:$E$63,2,0))","v":""},{"$f":"IF(B178=\"\",\"\",VLOOKUP(B178,Colab!$C$14:$E$63,3,0))","v":""},null,{"$f":"IF(E178=\"\",\"\",VLOOKUP(E178,Treinamentos!$B$13:$G$42,5,0))","v":""},null,null,null,null,null,{"$f":"IF(E178=\"\",\"\",VLOOKUP(E178,Treinamentos!$B$13:$G$42,6,0))","v":""}]
[null,null,{"$f":"IF(B179=\"\",\"\",VLOOKUP(B179,Colab!$C$14:$E$63,2,0))","v":""},{"$f":"IF(B179=\"\",\"\",VLOOKUP(B179,Colab!$C$14:$E$63,3,0))","v":""},null,{"$f":"IF(E179=\"\",\"\",VLOOKUP(E179,Treinamentos!$B$13:$G$42,5,0))","v":""},null,null,null,null,null,{"$f":"IF(E179=\"\",\"\",VLOOKUP(E179,Treinamentos!$B$13:$G$42,6,0))","v":""}]
[null,null,{"$f":"IF(B180=\"\",\"\",VLOOKUP(B180,Colab!$C$14:$E$63,2,0))","v":""},{"$f":"IF(B180=\"\",\"\",VLOOKUP(B180,Colab!$C$14:$E$63,3,0))","v":""},null,{"$f":"IF(E180=\"\",\"\",VLOOKUP(E180,Treinamentos!$B$13:$G$42,5,0))","v":""},null,null,null,null,null,{"$f":"IF(E180=\"\",\"\",VLOOKUP(E180,Treinamentos!$B$13:$G$42,6,0))","v":""}]
[null,null,{"$f":"IF(B181=\"\",\"\",VLOOKUP(B181,Colab!$C$14:$E$63,2,0))","v":""},{"$f":"IF(B181=\"\",\"\",VLOOKUP(B181,Colab!$C$14:$E$63,3,0))","v":""},null,{"$f":"IF(E181=\"\",\"\",VLOOKUP(E181,Treinamentos!$B$13:$G$42,5,0))","v":""},null,null,null,null,null,{"$f":"IF(E181=\"\",\"\",VLOOKUP(E181,Treinamentos!$B$13:$G$42,6,0))","v":""}]
[null,null,{"$f":"IF(B182=\"\",\"\",VLOOKUP(B182,Colab!$C$14:$E$63,2,0))","v":""},{"$f":"IF(B182=\"\",\"\",VLOOKUP(B182,Colab!$C$14:$E$63,3,0))","v":""},null,{"$f":"IF(E182=\"\",\"\",VLOOKUP(E182,Treinamentos!$B$13:$G$42,5,0))","v":""},null,null,null,null,null,{"$f":"IF(E182=\"\",\"\",VLOOKUP(E182,Treinamentos!$B$13:$G$42,6,0))","v":""}]
[null,null,{"$f":"IF(B183=\"\",\"\",VLOOKUP(B183,Colab!$C$14:$E$63,2,0))","v":""},{"$f":"IF(B183=\"\",\"\",VLOOKUP(B183,Colab!$C$14:$E$63,3,0))","v":""},null,{"$f":"IF(E183=\"\",\"\",VLOOKUP(E183,Treinamentos!$B$13:$G$42,5,0))","v":""},null,null,null,null,null,{"$f":"IF(E183=\"\",\"\",VLOOKUP(E183,Treinamentos!$B$13:$G$42,6,0))","v":""}]
[null,null,{"$f":"IF(B184=\"\",\"\",VLOOKUP(B184,Colab!$C$14:$E$63,2,0))","v":""},{"$f":"IF(B184=\"\",\"\",VLOOKUP(B184,Colab!$C$14:$E$63,3,0))","v":""},null,{"$f":"IF(E184=\"\",\"\",VLOOKUP(E184,Treinamentos!$B$13:$G$42,5,0))","v":""},null,null,null,null,null,{"$f":"IF(E184=\"\",\"\",VLOOKUP(E184,Treinamentos!$B$13:$G$42,6,0))","v":""}]
[null,null,{"$f":"IF(B185=\"\",\"\",VLOOKUP(B185,Colab!$C$14:$E$63,2,0))","v":""},{"$f":"IF(B185=\"\",\"\",VLOOKUP(B185,Colab!$C$14:$E$63,3,0))","v":""},null,{"$f":"IF(E185=\"\",\"\",VLOOKUP(E185,Treinamentos!$B$13:$G$42,5,0))","v":""},null,null,null,null,null,{"$f":"IF(E185=\"\",\"\",VLOOKUP(E185,Treinamentos!$B$13:$G$42,6,0))","v":""}]
[null,null,{"$f":"IF(B186=\"\",\"\",VLOOKUP(B186,Colab!$C$14:$E$63,2,0))","v":""},{"$f":"IF(B186=\"\",\"\",VLOOKUP(B186,Colab!$C$14:$E$63,3,0))","v":""},null,{"$f":"IF(E186=\"\",\"\",VLOOKUP(E186,Treinamentos!$B$13:$G$42,5,0))","v":""},null,null,null,null,null,{"$f":"IF(E186=\"\",\"\",VLOOKUP(E186,Treinamentos!$B$13:$G$42,6,0))","v":""}]
[null,null,{"$f":"IF(B187=\"\",\"\",VLOOKUP(B187,Colab!$C$14:$E$63,2,0))","v":""},{"$f":"IF(B187=\"\",\"\",VLOOKUP(B187,Colab!$C$14:$E$63,3,0))","v":""},null,{"$f":"IF(E187=\"\",\"\",VLOOKUP(E187,Treinamentos!$B$13:$G$42,5,0))","v":""},null,null,null,null,null,{"$f":"IF(E187=\"\",\"\",VLOOKUP(E187,Treinamentos!$B$13:$G$42,6,0))","v":""}]
[null,null,{"$f":"IF(B188=\"\",\"\",VLOOKUP(B188,Colab!$C$14:$E$63,2,0))","v":""},{"$f":"IF(B188=\"\",\"\",VLOOKUP(B188,Colab!$C$14:$E$63,3,0))","v":""},null,{"$f":"IF(E188=\"\",\"\",VLOOKUP(E188,Treinamentos!$B$13:$G$42,5,0))","v":""},null,null,null,null,null,{"$f":"IF(E188=\"\",\"\",VLOOKUP(E188,Treinamentos!$B$13:$G$42,6,0))","v":""}]
[null,null,{"$f":"IF(B189=\"\",\"\",VLOOKUP(B189,Colab!$C$14:$E$63,2,0))","v":""},{"$f":"IF(B189=\"\",\"\",VLOOKUP(B189,Colab!$C$14:$E$63,3,0))","v":""},null,{"$f":"IF(E189=\"\",\"\",VLOOKUP(E189,Treinamentos!$B$13:$G$42,5,0))","v":""},null,null,null,null,null,{"$f":"IF(E189=\"\",\"\",VLOOKUP(E189,Treinamentos!$B$13:$G$42,6,0))","v":""}]
[null,null,{"$f":"IF(B190=\"\",\"\",VLOOKUP(B190,Colab!$C$14:$E$63,2,0))","v":""},{"$f":"IF(B190=\"\",\"\",VLOOKUP(B190,Colab!$C$14:$E$63,3,0))","v":""},null,{"$f":"IF(E190=\"\",\"\",VLOOKUP(E190,Treinamentos!$B$13:$G$42,5,0))","v":""},null,null,null,null,null,{"$f":"IF(E190=\"\",\"\",VLOOKUP(E190,Treinamentos!$B$13:$G$42,6,0))","v":""}]
[null,null,{"$f":"IF(B191=\"\",\"\",VLOOKUP(B191,Colab!$C$14:$E$63,2,0))","v":""},{"$f":"IF(B191=\"\",\"\",VLOOKUP(B191,Colab!$C$14:$E$63,3,0))","v":""},null,{"$f":"IF(E191=\"\",\"\",VLOOKUP(E191,Treinamentos!$B$13:$G$42,5,0))","v":""},null,null,null,null,null,{"$f":"IF(E191=\"\",\"\",VLOOKUP(E191,Treinamentos!$B$13:$G$42,6,0))","v":""}]
[null,null,{"$f":"IF(B192=\"\",\"\",VLOOKUP(B192,Colab!$C$14:$E$63,2,0))","v":""},{"$f":"IF(B192=\"\",\"\",VLOOKUP(B192,Colab!$C$14:$E$63,3,0))","v":""},null,{"$f":"IF(E192=\"\",\"\",VLOOKUP(E192,Treinamentos!$B$13:$G$42,5,0))","v":""},null,null,null,null,null,{"$f":"IF(E192=\"\",\"\",VLOOKUP(E192,Treinamentos!$B$13:$G$42,6,0))","v":""}]
[null,null,{"$f":"IF(B193=\"\",\"\",VLOOKUP(B193,Colab!$C$14:$E$63,2,0))","v":""},{"$f":"IF(B193=\"\",\"\",VLOOKUP(B193,Colab!$C$14:$E$63,3,0))","v":""},null,{"$f":"IF(E193=\"\",\"\",VLOOKUP(E193,Treinamentos!$B$13:$G$42,5,0))","v":""},null,null,null,null,null,{"$f":"IF(E193=\"\",\"\",VLOOKUP(E193,Treinamentos!$B$13:$G$42,6,0))","v":""}]
[null,null,{"$f":"IF(B194=\"\",\"\",VLOOKUP(B194,Colab!$C$14:$E$63,2,0))","v":""},{"$f":"IF(B194=\"\",\"\",VLOOKUP(B194,Colab!$C$14:$E$63,3,0))","v":""},null,{"$f":"IF(E194=\"\",\"\",VLOOKUP(E194,Treinamentos!$B$13:$G$42,5,0))","v":""},null,null,null,null,null,{"$f":"IF(E194=\"\",\"\",VLOOKUP(E194,Treinamentos!$B$13:$G$42,6,0))","v":""}]
[null,null,{"$f":"IF(B195=\"\",\"\",VLOOKUP(B195,Colab!$C$14:$E$63,2,0))","v":""},{"$f":"IF(B195=\"\",\"\",VLOOKUP(B195,Colab!$C$14:$E$63,3,0))","v":""},null,{"$f":"IF(E195=\"\",\"\",VLOOKUP(E195,Treinamentos!$B$13:$G$42,5,0))","v":""},null,null,null,null,null,{"$f":"IF(E195=\"\",\"\",VLOOKUP(E195,Treinamentos!$B$13:$G$42,6,0))","v":""}]
[null,null,{"$f":"IF(B196=\"\",\"\",VLOOKUP(B196,Colab!$C$14:$E$63,2,0))","v":""},{"$f":"IF(B196=\"\",\"\",VLOOKUP(B196,Colab!$C$14:$E$63,3,0))","v":""},null,{"$f":"IF(E196=\"\",\"\",VLOOKUP(E196,Treinamentos!$B$13:$G$42,5,0))","v":""},null,null,null,null,null,{"$f":"IF(E196=\"\",\"\",VLOOKUP(E196,Treinamentos!$B$13:$G$42,6,0))","v":""}]
[null,null,{"$f":"IF(B197=\"\",\"\",VLOOKUP(B197,Colab!$C$14:$E$63,2,0))","v":""},{"$f":"IF(B197=\"\",\"\",VLOOKUP(B197,Colab!$C$14:$E$63,3,0))","v":""},null,{"$f":"IF(E197=\"\",\"\",VLOOKUP(E197,Treinamentos!$B$13:$G$42,5,0))","v":""},null,null,null,null,null,{"$f":"IF(E197=\"\",\"\",VLOOKUP(E197,Treinamentos!$B$13:$G$42,6,0))","v":""}]
[null,null,{"$f":"IF(B198=\"\",\"\",VLOOKUP(B198,Colab!$C$14:$E$63,2,0))","v":""},{"$f":"IF(B198=\"\",\"\",VLOOKUP(B198,Colab!$C$14:$E$63,3,0))","v":""},null,{"$f":"IF(E198=\"\",\"\",VLOOKUP(E198,Treinamentos!$B$13:$G$42,5,0))","v":""},null,null,null,null,null,{"$f":"IF(E198=\"\",\"\",VLOOKUP(E198,Treinamentos!$B$13:$G$42,6,0))","v":""}]
[null,null,{"$f":"IF(B199=\"\",\"\",VLOOKUP(B199,Colab!$C$14:$E$63,2,0))","v":""},{"$f":"IF(B199=\"\",\"\",VLOOKUP(B199,Colab!$C$14:$E$63,3,0))","v":""},null,{"$f":"IF(E199=\"\",\"\",VLOOKUP(E199,Treinamentos!$B$13:$G$42,5,0))","v":""},null,null,null,null,null,{"$f":"IF(E199=\"\",\"\",VLOOKUP(E199,Treinamentos!$B$13:$G$42,6,0))","v":""}]
[null,null,{"$f":"IF(B200=\"\",\"\",VLOOKUP(B200,Colab!$C$14:$E$63,2,0))","v":""},{"$f":"IF(B200=\"\",\"\",VLOOKUP(B200,Colab!$C$14:$E$63,3,0))","v":""},null,{"$f":"IF(E200=\"\",\"\",VLOOKUP(E200,Treinamentos!$B$13:$G$42,5,0))","v":""},null,null,null,null,null,{"$f":"IF(E200=\"\",\"\",VLOOKUP(E200,Treinamentos!$B$13:$G$42,6,0))","v":""}]
[null,null,{"$f":"IF(B201=\"\",\"\",VLOOKUP(B201,Colab!$C$14:$E$63,2,0))","v":""},{"$f":"IF(B201=\"\",\"\",VLOOKUP(B201,Colab!$C$14:$E$63,3,0))","v":""},null,{"$f":"IF(E201=\"\",\"\",VLOOKUP(E201,Treinamentos!$B$13:$G$42,5,0))","v":""},null,null,null,null,null,{"$f":"IF(E201=\"\",\"\",VLOOKUP(E201,Treinamentos!$B$13:$G$42,6,0))","v":""}]
[null,null,{"$f":"IF(B202=\"\",\"\",VLOOKUP(B202,Colab!$C$14:$E$63,2,0))","v":""},{"$f":"IF(B202=\"\",\"\",VLOOKUP(B202,Colab!$C$14:$E$63,3,0))","v":""},null,{"$f":"IF(E202=\"\",\"\",VLOOKUP(E202,Treinamentos!$B$13:$G$42,5,0))","v":""},null,null,null,null,null,{"$f":"IF(E202=\"\",\"\",VLOOKUP(E202,Treinamentos!$B$13:$G$42,6,0))","v":""}]
[null,null,{"$f":"IF(B203=\"\",\"\",VLOOKUP(B203,Colab!$C$14:$E$63,2,0))","v":""},{"$f":"IF(B203=\"\",\"\",VLOOKUP(B203,Colab!$C$14:$E$63,3,0))","v":""},null,{"$f":"IF(E203=\"\",\"\",VLOOKUP(E203,Treinamentos!$B$13:$G$42,5,0))","v":""},null,null,null,null,null,{"$f":"IF(E203=\"\",\"\",VLOOKUP(E203,Treinamentos!$B$13:$G$42,6,0))","v":""}]
[null,null,{"$f":"IF(B204=\"\",\"\",VLOOKUP(B204,Colab!$C$14:$E$63,2,0))","v":""},{"$f":"IF(B204=\"\",\"\",VLOOKUP(B204,Colab!$C$14:$E$63,3,0))","v":""},null,{"$f":"IF(E204=\"\",\"\",VLOOKUP(E204,Treinamentos!$B$13:$G$42,5,0))","v":""},null,null,null,null,null,{"$f":"IF(E204=\"\",\"\",VLOOKUP(E204,Treinamentos!$B$13:$G$42,6,0))","v":""}]
[null,null,{"$f":"IF(B205=\"\",\"\",VLOOKUP(B205,Colab!$C$14:$E$63,2,0))","v":""},{"$f":"IF(B205=\"\",\"\",VLOOKUP(B205,Colab!$C$14:$E$63,3,0))","v":""},null,{"$f":"IF(E205=\"\",\"\",VLOOKUP(E205,Treinamentos!$B$13:$G$42,5,0))","v":""},null,null,null,null,null,{"$f":"IF(E205=\"\",\"\",VLOOKUP(E205,Treinamentos!$B$13:$G$42,6,0))","v":""}]
[null,null,{"$f":"IF(B206=\"\",\"\",VLOOKUP(B206,Colab!$C$14:$E$63,2,0))","v":""},{"$f":"IF(B206=\"\",\"\",VLOOKUP(B206,Colab!$C$14:$E$63,3,0))","v":""},null,{"$f":"IF(E206=\"\",\"\",VLOOKUP(E206,Treinamentos!$B$13:$G$42,5,0))","v":""},null,null,null,null,null,{"$f":"IF(E206=\"\",\"\",VLOOKUP(E206,Treinamentos!$B$13:$G$42,6,0))","v":""}]
[null,null,{"$f":"IF(B207=\"\",\"\",VLOOKUP(B207,Colab!$C$14:$E$63,2,0))","v":""},{"$f":"IF(B207=\"\",\"\",VLOOKUP(B207,Colab!$C$14:$E$63,3,0))","v":""},null,{"$f":"IF(E207=\"\",\"\",VLOOKUP(E207,Treinamentos!$B$13:$G$42,5,0))","v":""},null,null,null,null,null,{"$f":"IF(E207=\"\",\"\",VLOOKUP(E207,Treinamentos!$B$13:$G$42,6,0))","v":""}]
[null,null,{"$f":"IF(B208=\"\",\"\",VLOOKUP(B208,Colab!$C$14:$E$63,2,0))","v":""},{"$f":"IF(B208=\"\",\"\",VLOOKUP(B208,Colab!$C$14:$E$63,3,0))","v":""},null,{"$f":"IF(E208=\"\",\"\",VLOOKUP(E208,Treinamentos!$B$13:$G$42,5,0))","v":""},null,null,null,null,null,{"$f":"IF(E208=\"\",\"\",VLOOKUP(E208,Treinamentos!$B$13:$G$42,6,0))","v":""}]
[null,null,{"$f":"IF(B209=\"\",\"\",VLOOKUP(B209,Colab!$C$14:$E$63,2,0))","v":""},{"$f":"IF(B209=\"\",\"\",VLOOKUP(B209,Colab!$C$14:$E$63,3,0))","v":""},null,{"$f":"IF(E209=\"\",\"\",VLOOKUP(E209,Treinamentos!$B$13:$G$42,5,0))","v":""},null,null,null,null,null,{"$f":"IF(E209=\"\",\"\",VLOOKUP(E209,Treinamentos!$B$13:$G$42,6,0))","v":""}]
[null,null,{"$f":"IF(B210=\"\",\"\",VLOOKUP(B210,Colab!$C$14:$E$63,2,0))","v":""},{"$f":"IF(B210=\"\",\"\",VLOOKUP(B210,Colab!$C$14:$E$63,3,0))","v":""},null,{"$f":"IF(E210=\"\",\"\",VLOOKUP(E210,Treinamentos!$B$13:$G$42,5,0))","v":""},null,null,null,null,null,{"$f":"IF(E210=\"\",\"\",VLOOKUP(E210,Treinamentos!$B$13:$G$42,6,0))","v":""}]
[null,null,{"$f":"IF(B211=\"\",\"\",VLOOKUP(B211,Colab!$C$14:$E$63,2,0))","v":""},{"$f":"IF(B211=\"\",\"\",VLOOKUP(B211,Colab!$C$14:$E$63,3,0))","v":""},null,{"$f":"IF(E211=\"\",\"\",VLOOKUP(E211,Treinamentos!$B$13:$G$42,5,0))","v":""},null,null,null,null,null,{"$f":"IF(E211=\"\",\"\",VLOOKUP(E211,Treinamentos!$B$13:$G$42,6,0))","v":""}]
[null,null,{"$f":"IF(B212=\"\",\"\",VLOOKUP(B212,Colab!$C$14:$E$63,2,0))","v":""},{"$f":"IF(B212=\"\",\"\",VLOOKUP(B212,Colab!$C$14:$E$63,3,0))","v":""},null,{"$f":"IF(E212=\"\",\"\",VLOOKUP(E212,Treinamentos!$B$13:$G$42,5,0))","v":""},null,null,null,null,null,{"$f":"IF(E212=\"\",\"\",VLOOKUP(E212,Treinamentos!$B$13:$G$42,6,0))","v":""}]
[null,null,{"$f":"IF(B213=\"\",\"\",VLOOKUP(B213,Colab!$C$14:$E$63,2,0))","v":""},{"$f":"IF(B213=\"\",\"\",VLOOKUP(B213,Colab!$C$14:$E$63,3,0))","v":""},null,{"$f":"IF(E213=\"\",\"\",VLOOKUP(E213,Treinamentos!$B$13:$G$42,5,0))","v":""},null,null,null,null,null,{"$f":"IF(E213=\"\",\"\",VLOOKUP(E213,Treinamentos!$B$13:$G$42,6,0))","v":""}]
[null,null,{"$f":"IF(B214=\"\",\"\",VLOOKUP(B214,Colab!$C$14:$E$63,2,0))","v":""},{"$f":"IF(B214=\"\",\"\",VLOOKUP(B214,Colab!$C$14:$E$63,3,0))","v":""},null,{"$f":"IF(E214=\"\",\"\",VLOOKUP(E214,Treinamentos!$B$13:$G$42,5,0))","v":""},null,null,null,null,null,{"$f":"IF(E214=\"\",\"\",VLOOKUP(E214,Treinamentos!$B$13:$G$42,6,0))","v":""}]
[null,null,{"$f":"IF(B215=\"\",\"\",VLOOKUP(B215,Colab!$C$14:$E$63,2,0))","v":""},{"$f":"IF(B215=\"\",\"\",VLOOKUP(B215,Colab!$C$14:$E$63,3,0))","v":""},null,{"$f":"IF(E215=\"\",\"\",VLOOKUP(E215,Treinamentos!$B$13:$G$42,5,0))","v":""},null,null,null,null,null,{"$f":"IF(E215=\"\",\"\",VLOOKUP(E215,Treinamentos!$B$13:$G$42,6,0))","v":""}]
[null,null,{"$f":"IF(B216=\"\",\"\",VLOOKUP(B216,Colab!$C$14:$E$63,2,0))","v":""},{"$f":"IF(B216=\"\",\"\",VLOOKUP(B216,Colab!$C$14:$E$63,3,0))","v":""},null,{"$f":"IF(E216=\"\",\"\",VLOOKUP(E216,Treinamentos!$B$13:$G$42,5,0))","v":""},null,null,null,null,null,{"$f":"IF(E216=\"\",\"\",VLOOKUP(E216,Treinamentos!$B$13:$G$42,6,0))","v":""}]
[null,null,{"$f":"IF(B217=\"\",\"\",VLOOKUP(B217,Colab!$C$14:$E$63,2,0))","v":""},{"$f":"IF(B217=\"\",\"\",VLOOKUP(B217,Colab!$C$14:$E$63,3,0))","v":""},null,{"$f":"IF(E217=\"\",\"\",VLOOKUP(E217,Treinamentos!$B$13:$G$42,5,0))","v":""},null,null,null,null,null,{"$f":"IF(E217=\"\",\"\",VLOOKUP(E217,Treinamentos!$B$13:$G$42,6,0))","v":""}]
[null,null,{"$f":"IF(B218=\"\",\"\",VLOOKUP(B218,Colab!$C$14:$E$63,2,0))","v":""},{"$f":"IF(B218=\"\",\"\",VLOOKUP(B218,Colab!$C$14:$E$63,3,0))","v":""},null,{"$f":"IF(E218=\"\",\"\",VLOOKUP(E218,Treinamentos!$B$13:$G$42,5,0))","v":""},null,null,null,null,null,{"$f":"IF(E218=\"\",\"\",VLOOKUP(E218,Treinamentos!$B$13:$G$42,6,0))","v":""}]
[null,null,{"$f":"IF(B219=\"\",\"\",VLOOKUP(B219,Colab!$C$14:$E$63,2,0))","v":""},{"$f":"IF(B219=\"\",\"\",VLOOKUP(B219,Colab!$C$14:$E$63,3,0))","v":""},null,{"$f":"IF(E219=\"\",\"\",VLOOKUP(E219,Treinamentos!$B$13:$G$42,5,0))","v":""},null,null,null,null,null,{"$f":"IF(E219=\"\",\"\",VLOOKUP(E219,Treinamentos!$B$13:$G$42,6,0))","v":""}]
[null,null,{"$f":"IF(B220=\"\",\"\",VLOOKUP(B220,Colab!$C$14:$E$63,2,0))","v":""},{"$f":"IF(B220=\"\",\"\",VLOOKUP(B220,Colab!$C$14:$E$63,3,0))","v":""},null,{"$f":"IF(E220=\"\",\"\",VLOOKUP(E220,Treinamentos!$B$13:$G$42,5,0))","v":""},null,null,null,null,null,{"$f":"IF(E220=\"\",\"\",VLOOKUP(E220,Treinamentos!$B$13:$G$42,6,0))","v":""}]
[null,null,{"$f":"IF(B221=\"\",\"\",VLOOKUP(B221,Colab!$C$14:$E$63,2,0))","v":""},{"$f":"IF(B221=\"\",\"\",VLOOKUP(B221,Colab!$C$14:$E$63,3,0))","v":""},null,{"$f":"IF(E221=\"\",\"\",VLOOKUP(E221,Treinamentos!$B$13:$G$42,5,0))","v":""},null,null,null,null,null,{"$f":"IF(E221=\"\",\"\",VLOOKUP(E221,Treinamentos!$B$13:$G$42,6,0))","v":""}]
[null,null,{"$f":"IF(B222=\"\",\"\",VLOOKUP(B222,Colab!$C$14:$E$63,2,0))","v":""},{"$f":"IF(B222=\"\",\"\",VLOOKUP(B222,Colab!$C$14:$E$63,3,0))","v":""},null,{"$f":"IF(E222=\"\",\"\",VLOOKUP(E222,Treinamentos!$B$13:$G$42,5,0))","v":""},null,null,null,null,null,{"$f":"IF(E222=\"\",\"\",VLOOKUP(E222,Treinamentos!$B$13:$G$42,6,0))","v":""}]
[null,null,{"$f":"IF(B223=\"\",\"\",VLOOKUP(B223,Colab!$C$14:$E$63,2,0))","v":""},{"$f":"IF(B223=\"\",\"\",VLOOKUP(B223,Colab!$C$14:$E$63,3,0))","v":""},null,{"$f":"IF(E223=\"\",\"\",VLOOKUP(E223,Treinamentos!$B$13:$G$42,5,0))","v":""},null,null,null,null,null,{"$f":"IF(E223=\"\",\"\",VLOOKUP(E223,Treinamentos!$B$13:$G$42,6,0))","v":""}]
[null,null,{"$f":"IF(B224=\"\",\"\",VLOOKUP(B224,Colab!$C$14:$E$63,2,0))","v":""},{"$f":"IF(B224=\"\",\"\",VLOOKUP(B224,Colab!$C$14:$E$63,3,0))","v":""},null,{"$f":"IF(E224=\"\",\"\",VLOOKUP(E224,Treinamentos!$B$13:$G$42,5,0))","v":""},null,null,null,null,null,{"$f":"IF(E224=\"\",\"\",VLOOKUP(E224,Treinamentos!$B$13:$G$42,6,0))","v":""}]
[null,null,{"$f":"IF(B225=\"\",\"\",VLOOKUP(B225,Colab!$C$14:$E$63,2,0))","v":""},{"$f":"IF(B225=\"\",\"\",VLOOKUP(B225,Colab!$C$14:$E$63,3,0))","v":""},null,{"$f":"IF(E225=\"\",\"\",VLOOKUP(E225,Treinamentos!$B$13:$G$42,5,0))","v":""},null,null,null,null,null,{"$f":"IF(E225=\"\",\"\",VLOOKUP(E225,Treinamentos!$B$13:$G$42,6,0))","v":""}]
[null,null,{"$f":"IF(B226=\"\",\"\",VLOOKUP(B226,Colab!$C$14:$E$63,2,0))","v":""},{"$f":"IF(B226=\"\",\"\",VLOOKUP(B226,Colab!$C$14:$E$63,3,0))","v":""},null,{"$f":"IF(E226=\"\",\"\",VLOOKUP(E226,Treinamentos!$B$13:$G$42,5,0))","v":""},null,null,null,null,null,{"$f":"IF(E226=\"\",\"\",VLOOKUP(E226,Treinamentos!$B$13:$G$42,6,0))","v":""}]
[null,null,{"$f":"IF(B227=\"\",\"\",VLOOKUP(B227,Colab!$C$14:$E$63,2,0))","v":""},{"$f":"IF(B227=\"\",\"\",VLOOKUP(B227,Colab!$C$14:$E$63,3,0))","v":""},null,{"$f":"IF(E227=\"\",\"\",VLOOKUP(E227,Treinamentos!$B$13:$G$42,5,0))","v":""},null,null,null,null,null,{"$f":"IF(E227=\"\",\"\",VLOOKUP(E227,Treinamentos!$B$13:$G$42,6,0))","v":""}]
[null,null,{"$f":"IF(B228=\"\",\"\",VLOOKUP(B228,Colab!$C$14:$E$63,2,0))","v":""},{"$f":"IF(B228=\"\",\"\",VLOOKUP(B228,Colab!$C$14:$E$63,3,0))","v":""},null,{"$f":"IF(E228=\"\",\"\",VLOOKUP(E228,Treinamentos!$B$13:$G$42,5,0))","v":""},null,null,null,null,null,{"$f":"IF(E228=\"\",\"\",VLOOKUP(E228,Treinamentos!$B$13:$G$42,6,0))","v":""}]
[null,null,{"$f":"IF(B229=\"\",\"\",VLOOKUP(B229,Colab!$C$14:$E$63,2,0))","v":""},{"$f":"IF(B229=\"\",\"\",VLOOKUP(B229,Colab!$C$14:$E$63,3,0))","v":""},null,{"$f":"IF(E229=\"\",\"\",VLOOKUP(E229,Treinamentos!$B$13:$G$42,5,0))","v":""},null,null,null,null,null,{"$f":"IF(E229=\"\",\"\",VLOOKUP(E229,Treinamentos!$B$13:$G$42,6,0))","v":""}]
[null,null,{"$f":"IF(B230=\"\",\"\",VLOOKUP(B230,Colab!$C$14:$E$63,2,0))","v":""},{"$f":"IF(B230=\"\",\"\",VLOOKUP(B230,Colab!$C$14:$E$63,3,0))","v":""},null,{"$f":"IF(E230=\"\",\"\",VLOOKUP(E230,Treinamentos!$B$13:$G$42,5,0))","v":""},null,null,null,null,null,{"$f":"IF(E230=\"\",\"\",VLOOKUP(E230,Treinamentos!$B$13:$G$42,6,0))","v":""}]
[null,null,{"$f":"IF(B231=\"\",\"\",VLOOKUP(B231,Colab!$C$14:$E$63,2,0))","v":""},{"$f":"IF(B231=\"\",\"\",VLOOKUP(B231,Colab!$C$14:$E$63,3,0))","v":""},null,{"$f":"IF(E231=\"\",\"\",VLOOKUP(E231,Treinamentos!$B$13:$G$42,5,0))","v":""},null,null,null,null,null,{"$f":"IF(E231=\"\",\"\",VLOOKUP(E231,Treinamentos!$B$13:$G$42,6,0))","v":""}]
[null,null,{"$f":"IF(B232=\"\",\"\",VLOOKUP(B232,Colab!$C$14:$E$63,2,0))","v":""},{"$f":"IF(B232=\"\",\"\",VLOOKUP(B232,Colab!$C$14:$E$63,3,0))","v":""},null,{"$f":"IF(E232=\"\",\"\",VLOOKUP(E232,Treinamentos!$B$13:$G$42,5,0))","v":""},null,null,null,null,null,{"$f":"IF(E232=\"\",\"\",VLOOKUP(E232,Treinamentos!$B$13:$G$42,6,0))","v":""}]
[null,null,{"$f":"IF(B233=\"\",\"\",VLOOKUP(B233,Colab!$C$14:$E$63,2,0))","v":""},{"$f":"IF(B233=\"\",\"\",VLOOKUP(B233,Colab!$C$14:$E$63,3,0))","v":""},null,{"$f":"IF(E233=\"\",\"\",VLOOKUP(E233,Treinamentos!$B$13:$G$42,5,0))","v":""},null,null,null,null,null,{"$f":"IF(E233=\"\",\"\",VLOOKUP(E233,Treinamentos!$B$13:$G$42,6,0))","v":""}]
[null,null,{"$f":"IF(B234=\"\",\"\",VLOOKUP(B234,Colab!$C$14:$E$63,2,0))","v":""},{"$f":"IF(B234=\"\",\"\",VLOOKUP(B234,Colab!$C$14:$E$63,3,0))","v":""},null,{"$f":"IF(E234=\"\",\"\",VLOOKUP(E234,Treinamentos!$B$13:$G$42,5,0))","v":""},null,null,null,null,null,{"$f":"IF(E234=\"\",\"\",VLOOKUP(E234,Treinamentos!$B$13:$G$42,6,0))","v":""}]
[null,null,{"$f":"IF(B235=\"\",\"\",VLOOKUP(B235,Colab!$C$14:$E$63,2,0))","v":""},{"$f":"IF(B235=\"\",\"\",VLOOKUP(B235,Colab!$C$14:$E$63,3,0))","v":""},null,{"$f":"IF(E235=\"\",\"\",VLOOKUP(E235,Treinamentos!$B$13:$G$42,5,0))","v":""},null,null,null,null,null,{"$f":"IF(E235=\"\",\"\",VLOOKUP(E235,Treinamentos!$B$13:$G$42,6,0))","v":""}]
[null,null,{"$f":"IF(B236=\"\",\"\",VLOOKUP(B236,Colab!$C$14:$E$63,2,0))","v":""},{"$f":"IF(B236=\"\",\"\",VLOOKUP(B236,Colab!$C$14:$E$63,3,0))","v":""},null,{"$f":"IF(E236=\"\",\"\",VLOOKUP(E236,Treinamentos!$B$13:$G$42,5,0))","v":""},null,null,null,null,null,{"$f":"IF(E236=\"\",\"\",VLOOKUP(E236,Treinamentos!$B$13:$G$42,6,0))","v":""}]
[null,null,{"$f":"IF(B237=\"\",\"\",VLOOKUP(B237,Colab!$C$14:$E$63,2,0))","v":""},{"$f":"IF(B237=\"\",\"\",VLOOKUP(B237,Colab!$C$14:$E$63,3,0))","v":""},null,{"$f":"IF(E237=\"\",\"\",VLOOKUP(E237,Treinamentos!$B$13:$G$42,5,0))","v":""},null,null,null,null,null,{"$f":"IF(E237=\"\",\"\",VLOOKUP(E237,Treinamentos!$B$13:$G$42,6,0))","v":""}]
[null,null,{"$f":"IF(B238=\"\",\"\",VLOOKUP(B238,Colab!$C$14:$E$63,2,0))","v":""},{"$f":"IF(B238=\"\",\"\",VLOOKUP(B238,Colab!$C$14:$E$63,3,0))","v":""},null,{"$f":"IF(E238=\"\",\"\",VLOOKUP(E238,Treinamentos!$B$13:$G$42,5,0))","v":""},null,null,null,null,null,{"$f":"IF(E238=\"\",\"\",VLOOKUP(E238,Treinamentos!$B$13:$G$42,6,0))","v":""}]
[null,null,{"$f":"IF(B239=\"\",\"\",VLOOKUP(B239,Colab!$C$14:$E$63,2,0))","v":""},{"$f":"IF(B239=\"\",\"\",VLOOKUP(B239,Colab!$C$14:$E$63,3,0))","v":""},null,{"$f":"IF(E239=\"\",\"\",VLOOKUP(E239,Treinamentos!$B$13:$G$42,5,0))","v":""},null,null,null,null,null,{"$f":"IF(E239=\"\",\"\",VLOOKUP(E239,Treinamentos!$B$13:$G$42,6,0))","v":""}]
[null,null,{"$f":"IF(B240=\"\",\"\",VLOOKUP(B240,Colab!$C$14:$E$63,2,0))","v":""},{"$f":"IF(B240=\"\",\"\",VLOOKUP(B240,Colab!$C$14:$E$63,3,0))","v":""},null,{"$f":"IF(E240=\"\",\"\",VLOOKUP(E240,Treinamentos!$B$13:$G$42,5,0))","v":""},null,null,null,null,null,{"$f":"IF(E240=\"\",\"\",VLOOKUP(E240,Treinamentos!$B$13:$G$42,6,0))","v":""}]
[null,null,{"$f":"IF(B241=\"\",\"\",VLOOKUP(B241,Colab!$C$14:$E$63,2,0))","v":""},{"$f":"IF(B241=\"\",\"\",VLOOKUP(B241,Colab!$C$14:$E$63,3,0))","v":""},null,{"$f":"IF(E241=\"\",\"\",VLOOKUP(E241,Treinamentos!$B$13:$G$42,5,0))","v":""},null,null,null,null,null,{"$f":"IF(E241=\"\",\"\",VLOOKUP(E241,Treinamentos!$B$13:$G$42,6,0))","v":""}]
[null,null,{"$f":"IF(B242=\"\",\"\",VLOOKUP(B242,Colab!$C$14:$E$63,2,0))","v":""},{"$f":"IF(B242=\"\",\"\",VLOOKUP(B242,Colab!$C$14:$E$63,3,0))","v":""},null,{"$f":"IF(E242=\"\",\"\",VLOOKUP(E242,Treinamentos!$B$13:$G$42,5,0))","v":""},null,null,null,null,null,{"$f":"IF(E242=\"\",\"\",VLOOKUP(E242,Treinamentos!$B$13:$G$42,6,0))","v":""}]
[null,null,{"$f":"IF(B243=\"\",\"\",VLOOKUP(B243,Colab!$C$14:$E$63,2,0))","v":""},{"$f":"IF(B243=\"\",\"\",VLOOKUP(B243,Colab!$C$14:$E$63,3,0))","v":""},null,{"$f":"IF(E243=\"\",\"\",VLOOKUP(E243,Treinamentos!$B$13:$G$42,5,0))","v":""},null,null,null,null,null,{"$f":"IF(E243=\"\",\"\",VLOOKUP(E243,Treinamentos!$B$13:$G$42,6,0))","v":""}]
[null,null,{"$f":"IF(B244=\"\",\"\",VLOOKUP(B244,Colab!$C$14:$E$63,2,0))","v":""},{"$f":"IF(B244=\"\",\"\",VLOOKUP(B244,Colab!$C$14:$E$63,3,0))","v":""},null,{"$f":"IF(E244=\"\",\"\",VLOOKUP(E244,Treinamentos!$B$13:$G$42,5,0))","v":""},null,null,null,null,null,{"$f":"IF(E244=\"\",\"\",VLOOKUP(E244,Treinamentos!$B$13:$G$42,6,0))","v":""}]
[null,null,{"$f":"IF(B245=\"\",\"\",VLOOKUP(B245,Colab!$C$14:$E$63,2,0))","v":""},{"$f":"IF(B245=\"\",\"\",VLOOKUP(B245,Colab!$C$14:$E$63,3,0))","v":""},null,{"$f":"IF(E245=\"\",\"\",VLOOKUP(E245,Treinamentos!$B$13:$G$42,5,0))","v":""},null,null,null,null,null,{"$f":"IF(E245=\"\",\"\",VLOOKUP(E245,Treinamentos!$B$13:$G$42,6,0))","v":""}]
[null,null,{"$f":"IF(B246=\"\",\"\",VLOOKUP(B246,Colab!$C$14:$E$63,2,0))","v":""},{"$f":"IF(B246=\"\",\"\",VLOOKUP(B246,Colab!$C$14:$E$63,3,0))","v":""},null,{"$f":"IF(E246=\"\",\"\",VLOOKUP(E246,Treinamentos!$B$13:$G$42,5,0))","v":""},null,null,null,null,null,{"$f":"IF(E246=\"\",\"\",VLOOKUP(E246,Treinamentos!$B$13:$G$42,6,0))","v":""}]
[null,null,{"$f":"IF(B247=\"\",\"\",VLOOKUP(B247,Colab!$C$14:$E$63,2,0))","v":""},{"$f":"IF(B247=\"\",\"\",VLOOKUP(B247,Colab!$C$14:$E$63,3,0))","v":""},null,{"$f":"IF(E247=\"\",\"\",VLOOKUP(E247,Treinamentos!$B$13:$G$42,5,0))","v":""},null,null,null,null,null,{"$f":"IF(E247=\"\",\"\",VLOOKUP(E247,Treinamentos!$B$13:$G$42,6,0))","v":""}]
[null,null,{"$f":"IF(B248=\"\",\"\",VLOOKUP(B248,Colab!$C$14:$E$63,2,0))","v":""},{"$f":"IF(B248=\"\",\"\",VLOOKUP(B248,Colab!$C$14:$E$63,3,0))","v":""},null,{"$f":"IF(E248=\"\",\"\",VLOOKUP(E248,Treinamentos!$B$13:$G$42,5,0))","v":""},null,null,null,null,null,{"$f":"IF(E248=\"\",\"\",VLOOKUP(E248,Treinamentos!$B$13:$G$42,6,0))","v":""}]
[null,null,{"$f":"IF(B249=\"\",\"\",VLOOKUP(B249,Colab!$C$14:$E$63,2,0))","v":""},{"$f":"IF(B249=\"\",\"\",VLOOKUP(B249,Colab!$C$14:$E$63,3,0))","v":""},null,{"$f":"IF(E249=\"\",\"\",VLOOKUP(E249,Treinamentos!$B$13:$G$42,5,0))","v":""},null,null,null,null,null,{"$f":"IF(E249=\"\",\"\",VLOOKUP(E249,Treinamentos!$B$13:$G$42,6,0))","v":""}]
[null,null,{"$f":"IF(B250=\"\",\"\",VLOOKUP(B250,Colab!$C$14:$E$63,2,0))","v":""},{"$f":"IF(B250=\"\",\"\",VLOOKUP(B250,Colab!$C$14:$E$63,3,0))","v":""},null,{"$f":"IF(E250=\"\",\"\",VLOOKUP(E250,Treinamentos!$B$13:$G$42,5,0))","v":""},null,null,null,null,null,{"$f":"IF(E250=\"\",\"\",VLOOKUP(E250,Treinamentos!$B$13:$G$42,6,0))","v":""}]
[null,null,{"$f":"IF(B251=\"\",\"\",VLOOKUP(B251,Colab!$C$14:$E$63,2,0))","v":""},{"$f":"IF(B251=\"\",\"\",VLOOKUP(B251,Colab!$C$14:$E$63,3,0))","v":""},null,{"$f":"IF(E251=\"\",\"\",VLOOKUP(E251,Treinamentos!$B$13:$G$42,5,0))","v":""},null,null,null,null,null,{"$f":"IF(E251=\"\",\"\",VLOOKUP(E251,Treinamentos!$B$13:$G$42,6,0))","v":""}]
[null,null,{"$f":"IF(B252=\"\",\"\",VLOOKUP(B252,Colab!$C$14:$E$63,2,0))","v":""},{"$f":"IF(B252=\"\",\"\",VLOOKUP(B252,Colab!$C$14:$E$63,3,0))","v":""},null,{"$f":"IF(E252=\"\",\"\",VLOOKUP(E252,Treinamentos!$B$13:$G$42,5,0))","v":""},null,null,null,null,null,{"$f":"IF(E252=\"\",\"\",VLOOKUP(E252,Treinamentos!$B$13:$G$42,6,0))","v":""}]
[null,null,{"$f":"IF(B253=\"\",\"\",VLOOKUP(B253,Colab!$C$14:$E$63,2,0))","v":""},{"$f":"IF(B253=\"\",\"\",VLOOKUP(B253,Colab!$C$14:$E$63,3,0))","v":""},null,{"$f":"IF(E253=\"\",\"\",VLOOKUP(E253,Treinamentos!$B$13:$G$42,5,0))","v":""},null,null,null,null,null,{"$f":"IF(E253=\"\",\"\",VLOOKUP(E253,Treinamentos!$B$13:$G$42,6,0))","v":""}]
[null,null,{"$f":"IF(B254=\"\",\"\",VLOOKUP(B254,Colab!$C$14:$E$63,2,0))","v":""},{"$f":"IF(B254=\"\",\"\",VLOOKUP(B254,Colab!$C$14:$E$63,3,0))","v":""},null,{"$f":"IF(E254=\"\",\"\",VLOOKUP(E254,Treinamentos!$B$13:$G$42,5,0))","v":""},null,null,null,null,null,{"$f":"IF(E254=\"\",\"\",VLOOKUP(E254,Treinamentos!$B$13:$G$42,6,0))","v":""}]
[null,null,{"$f":"IF(B255=\"\",\"\",VLOOKUP(B255,Colab!$C$14:$E$63,2,0))","v":""},{"$f":"IF(B255=\"\",\"\",VLOOKUP(B255,Colab!$C$14:$E$63,3,0))","v":""},null,{"$f":"IF(E255=\"\",\"\",VLOOKUP(E255,Treinamentos!$B$13:$G$42,5,0))","v":""},null,null,null,null,null,{"$f":"IF(E255=\"\",\"\",VLOOKUP(E255,Treinamentos!$B$13:$G$42,6,0))","v":""}]
[null,null,{"$f":"IF(B256=\"\",\"\",VLOOKUP(B256,Colab!$C$14:$E$63,2,0))","v":""},{"$f":"IF(B256=\"\",\"\",VLOOKUP(B256,Colab!$C$14:$E$63,3,0))","v":""},null,{"$f":"IF(E256=\"\",\"\",VLOOKUP(E256,Treinamentos!$B$13:$G$42,5,0))","v":""},null,null,null,null,null,{"$f":"IF(E256=\"\",\"\",VLOOKUP(E256,Treinamentos!$B$13:$G$42,6,0))","v":""}]
[null,null,{"$f":"IF(B257=\"\",\"\",VLOOKUP(B257,Colab!$C$14:$E$63,2,0))","v":""},{"$f":"IF(B257=\"\",\"\",VLOOKUP(B257,Colab!$C$14:$E$63,3,0))","v":""},null,{"$f":"IF(E257=\"\",\"\",VLOOKUP(E257,Treinamentos!$B$13:$G$42,5,0))","v":""},null,null,null,null,null,{"$f":"IF(E257=\"\",\"\",VLOOKUP(E257,Treinamentos!$B$13:$G$42,6,0))","v":""}]
[null,null,{"$f":"IF(B258=\"\",\"\",VLOOKUP(B258,Colab!$C$14:$E$63,2,0))","v":""},{"$f":"IF(B258=\"\",\"\",VLOOKUP(B258,Colab!$C$14:$E$63,3,0))","v":""},null,{"$f":"IF(E258=\"\",\"\",VLOOKUP(E258,Treinamentos!$B$13:$G$42,5,0))","v":""},null,null,null,null,null,{"$f":"IF(E258=\"\",\"\",VLOOKUP(E258,Treinamentos!$B$13:$G$42,6,0))","v":""}]
[null,null,{"$f":"IF(B259=\"\",\"\",VLOOKUP(B259,Colab!$C$14:$E$63,2,0))","v":""},{"$f":"IF(B259=\"\",\"\",VLOOKUP(B259,Colab!$C$14:$E$63,3,0))","v":""},null,{"$f":"IF(E259=\"\",\"\",VLOOKUP(E259,Treinamentos!$B$13:$G$42,5,0))","v":""},null,null,null,null,null,{"$f":"IF(E259=\"\",\"\",VLOOKUP(E259,Treinamentos!$B$13:$G$42,6,0))","v":""}]
[null,null,{"$f":"IF(B260=\"\",\"\",VLOOKUP(B260,Colab!$C$14:$E$63,2,0))","v":""},{"$f":"IF(B260=\"\",\"\",VLOOKUP(B260,Colab!$C$14:$E$63,3,0))","v":""},null,{"$f":"IF(E260=\"\",\"\",VLOOKUP(E260,Treinamentos!$B$13:$G$42,5,0))","v":""},null,null,null,null,null,{"$f":"IF(E260=\"\",\"\",VLOOKUP(E260,Treinamentos!$B$13:$G$42,6,0))","v":""}]
[null,null,{"$f":"IF(B261=\"\",\"\",VLOOKUP(B261,Colab!$C$14:$E$63,2,0))","v":""},{"$f":"IF(B261=\"\",\"\",VLOOKUP(B261,Colab!$C$14:$E$63,3,0))","v":""},null,{"$f":"IF(E261=\"\",\"\",VLOOKUP(E261,Treinamentos!$B$13:$G$42,5,0))","v":""},null,null,null,null,null,{"$f":"IF(E261=\"\",\"\",VLOOKUP(E261,Treinamentos!$B$13:$G$42,6,0))","v":""}]
[null,null,{"$f":"IF(B262=\"\",\"\",VLOOKUP(B262,Colab!$C$14:$E$63,2,0))","v":""},{"$f":"IF(B262=\"\",\"\",VLOOKUP(B262,Colab!$C$14:$E$63,3,0))","v":""},null,{"$f":"IF(E262=\"\",\"\",VLOOKUP(E262,Treinamentos!$B$13:$G$42,5,0))","v":""},null,null,null,null,null,{"$f":"IF(E262=\"\",\"\",VLOOKUP(E262,Treinamentos!$B$13:$G$42,6,0))","v":""}]
[null,null,{"$f":"IF(B263=\"\",\"\",VLOOKUP(B263,Colab!$C$14:$E$63,2,0))","v":""},{"$f":"IF(B263=\"\",\"\",VLOOKUP(B263,Colab!$C$14:$E$63,3,0))","v":""},null,{"$f":"IF(E263=\"\",\"\",VLOOKUP(E263,Treinamentos!$B$13:$G$42,5,0))","v":""},null,null,null,null,null,{"$f":"IF(E263=\"\",\"\",VLOOKUP(E263,Treinamentos!$B$13:$G$42,6,0))","v":""}]
[null,null,{"$f":"IF(B264=\"\",\"\",VLOOKUP(B264,Colab!$C$14:$E$63,2,0))","v":""},{"$f":"IF(B264=\"\",\"\",VLOOKUP(B264,Colab!$C$14:$E$63,3,0))","v":""},null,{"$f":"IF(E264=\"\",\"\",VLOOKUP(E264,Treinamentos!$B$13:$G$42,5,0))","v":""},null,null,null,null,null,{"$f":"IF(E264=\"\",\"\",VLOOKUP(E264,Treinamentos!$B$13:$G$42,6,0))","v":""}]
[null,null,{"$f":"IF(B265=\"\",\"\",VLOOKUP(B265,Colab!$C$14:$E$63,2,0))","v":""},{"$f":"IF(B265=\"\",\"\",VLOOKUP(B265,Colab!$C$14:$E$63,3,0))","v":""},null,{"$f":"IF(E265=\"\",\"\",VLOOKUP(E265,Treinamentos!$B$13:$G$42,5,0))","v":""},null,null,null,null,null,{"$f":"IF(E265=\"\",\"\",VLOOKUP(E265,Treinamentos!$B$13:$G$42,6,0))","v":""}]
[null,null,{"$f":"IF(B266=\"\",\"\",VLOOKUP(B266,Colab!$C$14:$E$63,2,0))","v":""},{"$f":"IF(B266=\"\",\"\",VLOOKUP(B266,Colab!$C$14:$E$63,3,0))","v":""},null,{"$f":"IF(E266=\"\",\"\",VLOOKUP(E266,Treinamentos!$B$13:$G$42,5,0))","v":""},null,null,null,null,null,{"$f":"IF(E266=\"\",\"\",VLOOKUP(E266,Treinamentos!$B$13:$G$42,6,0))","v":""}]
[null,null,{"$f":"IF(B267=\"\",\"\",VLOOKUP(B267,Colab!$C$14:$E$63,2,0))","v":""},{"$f":"IF(B267=\"\",\"\",VLOOKUP(B267,Colab!$C$14:$E$63,3,0))","v":""},null,{"$f":"IF(E267=\"\",\"\",VLOOKUP(E267,Treinamentos!$B$13:$G$42,5,0))","v":""},null,null,null,null,null,{"$f":"IF(E267=\"\",\"\",VLOOKUP(E267,Treinamentos!$B$13:$G$42,6,0))","v":""}]
[null,null,{"$f":"IF(B268=\"\",\"\",VLOOKUP(B268,Colab!$C$14:$E$63,2,0))","v":""},{"$f":"IF(B268=\"\",\"\",VLOOKUP(B268,Colab!$C$14:$E$63,3,0))","v":""},null,{"$f":"IF(E268=\"\",\"\",VLOOKUP(E268,Treinamentos!$B$13:$G$42,5,0))","v":""},null,null,null,null,null,{"$f":"IF(E268=\"\",\"\",VLOOKUP(E268,Treinamentos!$B$13:$G$42,6,0))","v":""}]
[null,null,{"$f":"IF(B269=\"\",\"\",VLOOKUP(B269,Colab!$C$14:$E$63,2,0))","v":""},{"$f":"IF(B269=\"\",\"\",VLOOKUP(B269,Colab!$C$14:$E$63,3,0))","v":""},null,{"$f":"IF(E269=\"\",\"\",VLOOKUP(E269,Treinamentos!$B$13:$G$42,5,0))","v":""},null,null,null,null,null,{"$f":"IF(E269=\"\",\"\",VLOOKUP(E269,Treinamentos!$B$13:$G$42,6,0))","v":""}]
[null,null,{"$f":"IF(B270=\"\",\"\",VLOOKUP(B270,Colab!$C$14:$E$63,2,0))","v":""},{"$f":"IF(B270=\"\",\"\",VLOOKUP(B270,Colab!$C$14:$E$63,3,0))","v":""},null,{"$f":"IF(E270=\"\",\"\",VLOOKUP(E270,Treinamentos!$B$13:$G$42,5,0))","v":""},null,null,null,null,null,{"$f":"IF(E270=\"\",\"\",VLOOKUP(E270,Treinamentos!$B$13:$G$42,6,0))","v":""}]
[null,null,{"$f":"IF(B271=\"\",\"\",VLOOKUP(B271,Colab!$C$14:$E$63,2,0))","v":""},{"$f":"IF(B271=\"\",\"\",VLOOKUP(B271,Colab!$C$14:$E$63,3,0))","v":""},null,{"$f":"IF(E271=\"\",\"\",VLOOKUP(E271,Treinamentos!$B$13:$G$42,5,0))","v":""},null,null,null,null,null,{"$f":"IF(E271=\"\",\"\",VLOOKUP(E271,Treinamentos!$B$13:$G$42,6,0))","v":""}]
[null,null,{"$f":"IF(B272=\"\",\"\",VLOOKUP(B272,Colab!$C$14:$E$63,2,0))","v":""},{"$f":"IF(B272=\"\",\"\",VLOOKUP(B272,Colab!$C$14:$E$63,3,0))","v":""},null,{"$f":"IF(E272=\"\",\"\",VLOOKUP(E272,Treinamentos!$B$13:$G$42,5,0))","v":""},null,null,null,null,null,{"$f":"IF(E272=\"\",\"\",VLOOKUP(E272,Treinamentos!$B$13:$G$42,6,0))","v":""}]
[null,null,{"$f":"IF(B273=\"\",\"\",VLOOKUP(B273,Colab!$C$14:$E$63,2,0))","v":""},{"$f":"IF(B273=\"\",\"\",VLOOKUP(B273,Colab!$C$14:$E$63,3,0))","v":""},null,{"$f":"IF(E273=\"\",\"\",VLOOKUP(E273,Treinamentos!$B$13:$G$42,5,0))","v":""},null,null,null,null,null,{"$f":"IF(E273=\"\",\"\",VLOOKUP(E273,Treinamentos!$B$13:$G$42,6,0))","v":""}]
[null,null,{"$f":"IF(B274=\"\",\"\",VLOOKUP(B274,Colab!$C$14:$E$63,2,0))","v":""},{"$f":"IF(B274=\"\",\"\",VLOOKUP(B274,Colab!$C$14:$E$63,3,0))","v":""},null,{"$f":"IF(E274=\"\",\"\",VLOOKUP(E274,Treinamentos!$B$13:$G$42,5,0))","v":""},null,null,null,null,null,{"$f":"IF(E274=\"\",\"\",VLOOKUP(E274,Treinamentos!$B$13:$G$42,6,0))","v":""}]
[null,null,{"$f":"IF(B275=\"\",\"\",VLOOKUP(B275,Colab!$C$14:$E$63,2,0))","v":""},{"$f":"IF(B275=\"\",\"\",VLOOKUP(B275,Colab!$C$14:$E$63,3,0))","v":""},null,{"$f":"IF(E275=\"\",\"\",VLOOKUP(E275,Treinamentos!$B$13:$G$42,5,0))","v":""},null,null,null,null,null,{"$f":"IF(E275=\"\",\"\",VLOOKUP(E275,Treinamentos!$B$13:$G$42,6,0))","v":""}]
[null,null,{"$f":"IF(B276=\"\",\"\",VLOOKUP(B276,Colab!$C$14:$E$63,2,0))","v":""},{"$f":"IF(B276=\"\",\"\",VLOOKUP(B276,Colab!$C$14:$E$63,3,0))","v":""},null,{"$f":"IF(E276=\"\",\"\",VLOOKUP(E276,Treinamentos!$B$13:$G$42,5,0))","v":""},null,null,null,null,null,{"$f":"IF(E276=\"\",\"\",VLOOKUP(E276,Treinamentos!$B$13:$G$42,6,0))","v":""}]
[null,null,{"$f":"IF(B277=\"\",\"\",VLOOKUP(B277,Colab!$C$14:$E$63,2,0))","v":""},{"$f":"IF(B277=\"\",\"\",VLOOKUP(B277,Colab!$C$14:$E$63,3,0))","v":""},null,{"$f":"IF(E277=\"\",\"\",VLOOKUP(E277,Treinamentos!$B$13:$G$42,5,0))","v":""},null,null,null,null,null,{"$f":"IF(E277=\"\",\"\",VLOOKUP(E277,Treinamentos!$B$13:$G$42,6,0))","v":""}]
[null,null,{"$f":"IF(B278=\"\",\"\",VLOOKUP(B278,Colab!$C$14:$E$63,2,0))","v":""},{"$f":"IF(B278=\"\",\"\",VLOOKUP(B278,Colab!$C$14:$E$63,3,0))","v":""},null,{"$f":"IF(E278=\"\",\"\",VLOOKUP(E278,Treinamentos!$B$13:$G$42,5,0))","v":""},null,null,null,null,null,{"$f":"IF(E278=\"\",\"\",VLOOKUP(E278,Treinamentos!$B$13:$G$42,6,0))","v":""}]
[null,null,{"$f":"IF(B279=\"\",\"\",VLOOKUP(B279,Colab!$C$14:$E$63,2,0))","v":""},{"$f":"IF(B279=\"\",\"\",VLOOKUP(B279,Colab!$C$14:$E$63,3,0))","v":""},null,{"$f":"IF(E279=\"\",\"\",VLOOKUP(E279,Treinamentos!$B$13:$G$42,5,0))","v":""},null,null,null,null,null,{"$f":"IF(E279=\"\",\"\",VLOOKUP(E279,Treinamentos!$B$13:$G$42,6,0))","v":""}]
[null,null,{"$f":"IF(B280=\"\",\"\",VLOOKUP(B280,Colab!$C$14:$E$63,2,0))","v":""},{"$f":"IF(B280=\"\",\"\",VLOOKUP(B280,Colab!$C$14:$E$63,3,0))","v":""},null,{"$f":"IF(E280=\"\",\"\",VLOOKUP(E280,Treinamentos!$B$13:$G$42,5,0))","v":""},null,null,null,null,null,{"$f":"IF(E280=\"\",\"\",VLOOKUP(E280,Treinamentos!$B$13:$G$42,6,0))","v":""}]
[null,null,{"$f":"IF(B281=\"\",\"\",VLOOKUP(B281,Colab!$C$14:$E$63,2,0))","v":""},{"$f":"IF(B281=\"\",\"\",VLOOKUP(B281,Colab!$C$14:$E$63,3,0))","v":""},null,{"$f":"IF(E281=\"\",\"\",VLOOKUP(E281,Treinamentos!$B$13:$G$42,5,0))","v":""},null,null,null,null,null,{"$f":"IF(E281=\"\",\"\",VLOOKUP(E281,Treinamentos!$B$13:$G$42,6,0))","v":""}]
[null,null,{"$f":"IF(B282=\"\",\"\",VLOOKUP(B282,Colab!$C$14:$E$63,2,0))","v":""},{"$f":"IF(B282=\"\",\"\",VLOOKUP(B282,Colab!$C$14:$E$63,3,0))","v":""},null,{"$f":"IF(E282=\"\",\"\",VLOOKUP(E282,Treinamentos!$B$13:$G$42,5,0))","v":""},null,null,null,null,null,{"$f":"IF(E282=\"\",\"\",VLOOKUP(E282,Treinamentos!$B$13:$G$42,6,0))","v":""}]
[null,null,{"$f":"IF(B283=\"\",\"\",VLOOKUP(B283,Colab!$C$14:$E$63,2,0))","v":""},{"$f":"IF(B283=\"\",\"\",VLOOKUP(B283,Colab!$C$14:$E$63,3,0))","v":""},null,{"$f":"IF(E283=\"\",\"\",VLOOKUP(E283,Treinamentos!$B$13:$G$42,5,0))","v":""},null,null,null,null,null,{"$f":"IF(E283=\"\",\"\",VLOOKUP(E283,Treinamentos!$B$13:$G$42,6,0))","v":""}]
[null,null,{"$f":"IF(B284=\"\",\"\",VLOOKUP(B284,Colab!$C$14:$E$63,2,0))","v":""},{"$f":"IF(B284=\"\",\"\",VLOOKUP(B284,Colab!$C$14:$E$63,3,0))","v":""},null,{"$f":"IF(E284=\"\",\"\",VLOOKUP(E284,Treinamentos!$B$13:$G$42,5,0))","v":""},null,null,null,null,null,{"$f":"IF(E284=\"\",\"\",VLOOKUP(E284,Treinamentos!$B$13:$G$42,6,0))","v":""}]
[null,null,{"$f":"IF(B285=\"\",\"\",VLOOKUP(B285,Colab!$C$14:$E$63,2,0))","v":""},{"$f":"IF(B285=\"\",\"\",VLOOKUP(B285,Colab!$C$14:$E$63,3,0))","v":""},null,{"$f":"IF(E285=\"\",\"\",VLOOKUP(E285,Treinamentos!$B$13:$G$42,5,0))","v":""},null,null,null,null,null,{"$f":"IF(E285=\"\",\"\",VLOOKUP(E285,Treinamentos!$B$13:$G$42,6,0))","v":""}]
[null,null,{"$f":"IF(B286=\"\",\"\",VLOOKUP(B286,Colab!$C$14:$E$63,2,0))","v":""},{"$f":"IF(B286=\"\",\"\",VLOOKUP(B286,Colab!$C$14:$E$63,3,0))","v":""},null,{"$f":"IF(E286=\"\",\"\",VLOOKUP(E286,Treinamentos!$B$13:$G$42,5,0))","v":""},null,null,null,null,null,{"$f":"IF(E286=\"\",\"\",VLOOKUP(E286,Treinamentos!$B$13:$G$42,6,0))","v":""}]
[null,null,{"$f":"IF(B287=\"\",\"\",VLOOKUP(B287,Colab!$C$14:$E$63,2,0))","v":""},{"$f":"IF(B287=\"\",\"\",VLOOKUP(B287,Colab!$C$14:$E$63,3,0))","v":""},null,{"$f":"IF(E287=\"\",\"\",VLOOKUP(E287,Treinamentos!$B$13:$G$42,5,0))","v":""},null,null,null,null,null,{"$f":"IF(E287=\"\",\"\",VLOOKUP(E287,Treinamentos!$B$13:$G$42,6,0))","v":""}]
[null,null,{"$f":"IF(B288=\"\",\"\",VLOOKUP(B288,Colab!$C$14:$E$63,2,0))","v":""},{"$f":"IF(B288=\"\",\"\",VLOOKUP(B288,Colab!$C$14:$E$63,3,0))","v":""},null,{"$f":"IF(E288=\"\",\"\",VLOOKUP(E288,Treinamentos!$B$13:$G$42,5,0))","v":""},null,null,null,null,null,{"$f":"IF(E288=\"\",\"\",VLOOKUP(E288,Treinamentos!$B$13:$G$42,6,0))","v":""}]
[null,null,{"$f":"IF(B289=\"\",\"\",VLOOKUP(B289,Colab!$C$14:$E$63,2,0))","v":""},{"$f":"IF(B289=\"\",\"\",VLOOKUP(B289,Colab!$C$14:$E$63,3,0))","v":""},null,{"$f":"IF(E289=\"\",\"\",VLOOKUP(E289,Treinamentos!$B$13:$G$42,5,0))","v":""},null,null,null,null,null,{"$f":"IF(E289=\"\",\"\",VLOOKUP(E289,Treinamentos!$B$13:$G$42,6,0))","v":""}]
[null,null,{"$f":"IF(B290=\"\",\"\",VLOOKUP(B290,Colab!$C$14:$E$63,2,0))","v":""},{"$f":"IF(B290=\"\",\"\",VLOOKUP(B290,Colab!$C$14:$E$63,3,0))","v":""},null,{"$f":"IF(E290=\"\",\"\",VLOOKUP(E290,Treinamentos!$B$13:$G$42,5,0))","v":""},null,null,null,null,null,{"$f":"IF(E290=\"\",\"\",VLOOKUP(E290,Treinamentos!$B$13:$G$42,6,0))","v":""}]
[null,null,{"$f":"IF(B291=\"\",\"\",VLOOKUP(B291,Colab!$C$14:$E$63,2,0))","v":""},{"$f":"IF(B291=\"\",\"\",VLOOKUP(B291,Colab!$C$14:$E$63,3,0))","v":""},null,{"$f":"IF(E291=\"\",\"\",VLOOKUP(E291,Treinamentos!$B$13:$G$42,5,0))","v":""},null,null,null,null,null,{"$f":"IF(E291=\"\",\"\",VLOOKUP(E291,Treinamentos!$B$13:$G$42,6,0))","v":""}]
[null,null,{"$f":"IF(B292=\"\",\"\",VLOOKUP(B292,Colab!$C$14:$E$63,2,0))","v":""},{"$f":"IF(B292=\"\",\"\",VLOOKUP(B292,Colab!$C$14:$E$63,3,0))","v":""},null,{"$f":"IF(E292=\"\",\"\",VLOOKUP(E292,Treinamentos!$B$13:$G$42,5,0))","v":""},null,null,null,null,null,{"$f":"IF(E292=\"\",\"\",VLOOKUP(E292,Treinamentos!$B$13:$G$42,6,0))","v":""}]
[null,null,{"$f":"IF(B293=\"\",\"\",VLOOKUP(B293,Colab!$C$14:$E$63,2,0))","v":""},{"$f":"IF(B293=\"\",\"\",VLOOKUP(B293,Colab!$C$14:$E$63,3,0))","v":""},null,{"$f":"IF(E293=\"\",\"\",VLOOKUP(E293,Treinamentos!$B$13:$G$42,5,0))","v":""},null,null,null,null,null,{"$f":"IF(E293=\"\",\"\",VLOOKUP(E293,Treinamentos!$B$13:$G$42,6,0))","v":""}]
[null,null,{"$f":"IF(B294=\"\",\"\",VLOOKUP(B294,Colab!$C$14:$E$63,2,0))","v":""},{"$f":"IF(B294=\"\",\"\",VLOOKUP(B294,Colab!$C$14:$E$63,3,0))","v":""},null,{"$f":"IF(E294=\"\",\"\",VLOOKUP(E294,Treinamentos!$B$13:$G$42,5,0))","v":""},null,null,null,null,null,{"$f":"IF(E294=\"\",\"\",VLOOKUP(E294,Treinamentos!$B$13:$G$42,6,0))","v":""}]
[null,null,{"$f":"IF(B295=\"\",\"\",VLOOKUP(B295,Colab!$C$14:$E$63,2,0))","v":""},{"$f":"IF(B295=\"\",\"\",VLOOKUP(B295,Colab!$C$14:$E$63,3,0))","v":""},null,{"$f":"IF(E295=\"\",\"\",VLOOKUP(E295,Treinamentos!$B$13:$G$42,5,0))","v":""},null,null,null,null,null,{"$f":"IF(E295=\"\",\"\",VLOOKUP(E295,Treinamentos!$B$13:$G$42,6,0))","v":""}]
[null,null,{"$f":"IF(B296=\"\",\"\",VLOOKUP(B296,Colab!$C$14:$E$63,2,0))","v":""},{"$f":"IF(B296=\"\",\"\",VLOOKUP(B296,Colab!$C$14:$E$63,3,0))","v":""},null,{"$f":"IF(E296=\"\",\"\",VLOOKUP(E296,Treinamentos!$B$13:$G$42,5,0))","v":""},null,null,null,null,null,{"$f":"IF(E296=\"\",\"\",VLOOKUP(E296,Treinamentos!$B$13:$G$42,6,0))","v":""}]
[null,null,{"$f":"IF(B297=\"\",\"\",VLOOKUP(B297,Colab!$C$14:$E$63,2,0))","v":""},{"$f":"IF(B297=\"\",\"\",VLOOKUP(B297,Colab!$C$14:$E$63,3,0))","v":""},null,{"$f":"IF(E297=\"\",\"\",VLOOKUP(E297,Treinamentos!$B$13:$G$42,5,0))","v":""},null,null,null,null,null,{"$f":"IF(E297=\"\",\"\",VLOOKUP(E297,Treinamentos!$B$13:$G$42,6,0))","v":""}]
[null,null,{"$f":"IF(B298=\"\",\"\",VLOOKUP(B298,Colab!$C$14:$E$63,2,0))","v":""},{"$f":"IF(B298=\"\",\"\",VLOOKUP(B298,Colab!$C$14:$E$63,3,0))","v":""},null,{"$f":"IF(E298=\"\",\"\",VLOOKUP(E298,Treinamentos!$B$13:$G$42,5,0))","v":""},null,null,null,null,null,{"$f":"IF(E298=\"\",\"\",VLOOKUP(E298,Treinamentos!$B$13:$G$42,6,0))","v":""}]
[null,null,{"$f":"IF(B299=\"\",\"\",VLOOKUP(B299,Colab!$C$14:$E$63,2,0))","v":""},{"$f":"IF(B299=\"\",\"\",VLOOKUP(B299,Colab!$C$14:$E$63,3,0))","v":""},null,{"$f":"IF(E299=\"\",\"\",VLOOKUP(E299,Treinamentos!$B$13:$G$42,5,0))","v":""},null,null,null,null,null,{"$f":"IF(E299=\"\",\"\",VLOOKUP(E299,Treinamentos!$B$13:$G$42,6,0))","v":""}]
[null,null,{"$f":"IF(B300=\"\",\"\",VLOOKUP(B300,Colab!$C$14:$E$63,2,0))","v":""},{"$f":"IF(B300=\"\",\"\",VLOOKUP(B300,Colab!$C$14:$E$63,3,0))","v":""},null,{"$f":"IF(E300=\"\",\"\",VLOOKUP(E300,Treinamentos!$B$13:$G$42,5,0))","v":""},null,null,null,null,null,{"$f":"IF(E300=\"\",\"\",VLOOKUP(E300,Treinamentos!$B$13:$G$42,6,0))","v":""}]
[null,null,{"$f":"IF(B301=\"\",\"\",VLOOKUP(B301,Colab!$C$14:$E$63,2,0))","v":""},{"$f":"IF(B301=\"\",\"\",VLOOKUP(B301,Colab!$C$14:$E$63,3,0))","v":""},null,{"$f":"IF(E301=\"\",\"\",VLOOKUP(E301,Treinamentos!$B$13:$G$42,5,0))","v":""},null,null,null,null,null,{"$f":"IF(E301=\"\",\"\",VLOOKUP(E301,Treinamentos!$B$13:$G$42,6,0))","v":""}]
[null,null,{"$f":"IF(B302=\"\",\"\",VLOOKUP(B302,Colab!$C$14:$E$63,2,0))","v":""},{"$f":"IF(B302=\"\",\"\",VLOOKUP(B302,Colab!$C$14:$E$63,3,0))","v":""},null,{"$f":"IF(E302=\"\",\"\",VLOOKUP(E302,Treinamentos!$B$13:$G$42,5,0))","v":""},null,null,null,null,null,{"$f":"IF(E302=\"\",\"\",VLOOKUP(E302,Treinamentos!$B$13:$G$42,6,0))","v":""}]
[null,null,{"$f":"IF(B303=\"\",\"\",VLOOKUP(B303,Colab!$C$14:$E$63,2,0))","v":""},{"$f":"IF(B303=\"\",\"\",VLOOKUP(B303,Colab!$C$14:$E$63,3,0))","v":""},null,{"$f":"IF(E303=\"\",\"\",VLOOKUP(E303,Treinamentos!$B$13:$G$42,5,0))","v":""},null,null,null,null,null,{"$f":"IF(E303=\"\",\"\",VLOOKUP(E303,Treinamentos!$B$13:$G$42,6,0))","v":""}]
[null,null,{"$f":"IF(B304=\"\",\"\",VLOOKUP(B304,Colab!$C$14:$E$63,2,0))","v":""},{"$f":"IF(B304=\"\",\"\",VLOOKUP(B304,Colab!$C$14:$E$63,3,0))","v":""},null,{"$f":"IF(E304=\"\",\"\",VLOOKUP(E304,Treinamentos!$B$13:$G$42,5,0))","v":""},null,null,null,null,null,{"$f":"IF(E304=\"\",\"\",VLOOKUP(E304,Treinamentos!$B$13:$G$42,6,0))","v":""}]
[null,null,{"$f":"IF(B305=\"\",\"\",VLOOKUP(B305,Colab!$C$14:$E$63,2,0))","v":""},{"$f":"IF(B305=\"\",\"\",VLOOKUP(B305,Colab!$C$14:$E$63,3,0))","v":""},null,{"$f":"IF(E305=\"\",\"\",VLOOKUP(E305,Treinamentos!$B$13:$G$42,5,0))","v":""},null,null,null,null,null,{"$f":"IF(E305=\"\",\"\",VLOOKUP(E305,Treinamentos!$B$13:$G$42,6,0))","v":""}]
[null,null,{"$f":"IF(B306=\"\",\"\",VLOOKUP(B306,Colab!$C$14:$E$63,2,0))","v":""},{"$f":"IF(B306=\"\",\"\",VLOOKUP(B306,Colab!$C$14:$E$63,3,0))","v":""},null,{"$f":"IF(E306=\"\",\"\",VLOOKUP(E306,Treinamentos!$B$13:$G$42,5,0))","v":""},null,null,null,null,null,{"$f":"IF(E306=\"\",\"\",VLOOKUP(E306,Treinamentos!$B$13:$G$42,6,0))","v":""}]
[null,null,{"$f":"IF(B307=\"\",\"\",VLOOKUP(B307,Colab!$C$14:$E$63,2,0))","v":""},{"$f":"IF(B307=\"\",\"\",VLOOKUP(B307,Colab!$C$14:$E$63,3,0))","v":""},null,{"$f":"IF(E307=\"\",\"\",VLOOKUP(E307,Treinamentos!$B$13:$G$42,5,0))","v":""},null,null,null,null,null,{"$f":"IF(E307=\"\",\"\",VLOOKUP(E307,Treinamentos!$B$13:$G$42,6,0))","v":""}]
[null,null,{"$f":"IF(B308=\"\",\"\",VLOOKUP(B308,Colab!$C$14:$E$63,2,0))","v":""},{"$f":"IF(B308=\"\",\"\",VLOOKUP(B308,Colab!$C$14:$E$63,3,0))","v":""},null,{"$f":"IF(E308=\"\",\"\",VLOOKUP(E308,Treinamentos!$B$13:$G$42,5,0))","v":""},null,null,null,null,null,{"$f":"IF(E308=\"\",\"\",VLOOKUP(E308,Treinamentos!$B$13:$G$42,6,0))","v":""}]
[null,null,{"$f":"IF(B309=\"\",\"\",VLOOKUP(B309,Colab!$C$14:$E$63,2,0))","v":""},{"$f":"IF(B309=\"\",\"\",VLOOKUP(B309,Colab!$C$14:$E$63,3,0))","v":""},null,{"$f":"IF(E309=\"\",\"\",VLOOKUP(E309,Treinamentos!$B$13:$G$42,5,0))","v":""},null,null,null,null,null,{"$f":"IF(E309=\"\",\"\",VLOOKUP(E309,Treinamentos!$B$13:$G$42,6,0))","v":""}]
[null,null,{"$f":"IF(B310=\"\",\"\",VLOOKUP(B310,Colab!$C$14:$E$63,2,0))","v":""},{"$f":"IF(B310=\"\",\"\",VLOOKUP(B310,Colab!$C$14:$E$63,3,0))","v":""},null,{"$f":"IF(E310=\"\",\"\",VLOOKUP(E310,Treinamentos!$B$13:$G$42,5,0))","v":""},null,null,null,null,null,{"$f":"IF(E310=\"\",\"\",VLOOKUP(E310,Treinamentos!$B$13:$G$42,6,0))","v":""}]
[null,null,{"$f":"IF(B311=\"\",\"\",VLOOKUP(B311,Colab!$C$14:$E$63,2,0))","v":""},{"$f":"IF(B311=\"\",\"\",VLOOKUP(B311,Colab!$C$14:$E$63,3,0))","v":""},null,{"$f":"IF(E311=\"\",\"\",VLOOKUP(E311,Treinamentos!$B$13:$G$42,5,0))","v":""},null,null,null,null,null,{"$f":"IF(E311=\"\",\"\",VLOOKUP(E311,Treinamentos!$B$13:$G$42,6,0))","v":""}]
[null,null,{"$f":"IF(B312=\"\",\"\",VLOOKUP(B312,Colab!$C$14:$E$63,2,0))","v":""},{"$f":"IF(B312=\"\",\"\",VLOOKUP(B312,Colab!$C$14:$E$63,3,0))","v":""},null,{"$f":"IF(E312=\"\",\"\",VLOOKUP(E312,Treinamentos!$B$13:$G$42,5,0))","v":""},null,null,null,null,null,{"$f":"IF(E312=\"\",\"\",VLOOKUP(E312,Treinamentos!$B$13:$G$42,6,0))","v":""}]
[null,null,{"$f":"IF(B313=\"\",\"\",VLOOKUP(B313,Colab!$C$14:$E$63,2,0))","v":""},{"$f":"IF(B313=\"\",\"\",VLOOKUP(B313,Colab!$C$14:$E$63,3,0))","v":""},null,{"$f":"IF(E313=\"\",\"\",VLOOKUP(E313,Treinamentos!$B$13:$G$42,5,0))","v":""},null,null,null,null,null,{"$f":"IF(E313=\"\",\"\",VLOOKUP(E313,Treinamentos!$B$13:$G$42,6,0))","v":""}]
[null,null,{"$f":"IF(B314=\"\",\"\",VLOOKUP(B314,Colab!$C$14:$E$63,2,0))","v":""},{"$f":"IF(B314=\"\",\"\",VLOOKUP(B314,Colab!$C$14:$E$63,3,0))","v":""},null,{"$f":"IF(E314=\"\",\"\",VLOOKUP(E314,Treinamentos!$B$13:$G$42,5,0))","v":""},null,null,null,null,null,{"$f":"IF(E314=\"\",\"\",VLOOKUP(E314,Treinamentos!$B$13:$G$42,6,0))","v":""}]
[null,null,{"$f":"IF(B315=\"\",\"\",VLOOKUP(B315,Colab!$C$14:$E$63,2,0))","v":""},{"$f":"IF(B315=\"\",\"\",VLOOKUP(B315,Colab!$C$14:$E$63,3,0))","v":""},null,{"$f":"IF(E315=\"\",\"\",VLOOKUP(E315,Treinamentos!$B$13:$G$42,5,0))","v":""},null,null,null,null,null,{"$f":"IF(E315=\"\",\"\",VLOOKUP(E315,Treinamentos!$B$13:$G$42,6,0))","v":""}]
[null,null,{"$f":"IF(B316=\"\",\"\",VLOOKUP(B316,Colab!$C$14:$E$63,2,0))","v":""},{"$f":"IF(B316=\"\",\"\",VLOOKUP(B316,Colab!$C$14:$E$63,3,0))","v":""},null,{"$f":"IF(E316=\"\",\"\",VLOOKUP(E316,Treinamentos!$B$13:$G$42,5,0))","v":""},null,null,null,null,null,{"$f":"IF(E316=\"\",\"\",VLOOKUP(E316,Treinamentos!$B$13:$G$42,6,0))","v":""}]
[null,null,{"$f":"IF(B317=\"\",\"\",VLOOKUP(B317,Colab!$C$14:$E$63,2,0))","v":""},{"$f":"IF(B317=\"\",\"\",VLOOKUP(B317,Colab!$C$14:$E$63,3,0))","v":""},null,{"$f":"IF(E317=\"\",\"\",VLOOKUP(E317,Treinamentos!$B$13:$G$42,5,0))","v":""},null,null,null,null,null,{"$f":"IF(E317=\"\",\"\",VLOOKUP(E317,Treinamentos!$B$13:$G$42,6,0))","v":""}]
[null,null,{"$f":"IF(B318=\"\",\"\",VLOOKUP(B318,Colab!$C$14:$E$63,2,0))","v":""},{"$f":"IF(B318=\"\",\"\",VLOOKUP(B318,Colab!$C$14:$E$63,3,0))","v":""},null,{"$f":"IF(E318=\"\",\"\",VLOOKUP(E318,Treinamentos!$B$13:$G$42,5,0))","v":""},null,null,null,null,null,{"$f":"IF(E318=\"\",\"\",VLOOKUP(E318,Treinamentos!$B$13:$G$42,6,0))","v":""}]
[null,null,{"$f":"IF(B319=\"\",\"\",VLOOKUP(B319,Colab!$C$14:$E$63,2,0))","v":""},{"$f":"IF(B319=\"\",\"\",VLOOKUP(B319,Colab!$C$14:$E$63,3,0))","v":""},null,{"$f":"IF(E319=\"\",\"\",VLOOKUP(E319,Treinamentos!$B$13:$G$42,5,0))","v":""},null,null,null,null,null,{"$f":"IF(E319=\"\",\"\",VLOOKUP(E319,Treinamentos!$B$13:$G$42,6,0))","v":""}]
[null,null,{"$f":"IF(B320=\"\",\"\",VLOOKUP(B320,Colab!$C$14:$E$63,2,0))","v":""},{"$f":"IF(B320=\"\",\"\",VLOOKUP(B320,Colab!$C$14:$E$63,3,0))","v":""},null,{"$f":"IF(E320=\"\",\"\",VLOOKUP(E320,Treinamentos!$B$13:$G$42,5,0))","v":""},null,null,null,null,null,{"$f":"IF(E320=\"\",\"\",VLOOKUP(E320,Treinamentos!$B$13:$G$42,6,0))","v":""}]
[null,null,{"$f":"IF(B321=\"\",\"\",VLOOKUP(B321,Colab!$C$14:$E$63,2,0))","v":""},{"$f":"IF(B321=\"\",\"\",VLOOKUP(B321,Colab!$C$14:$E$63,3,0))","v":""},null,{"$f":"IF(E321=\"\",\"\",VLOOKUP(E321,Treinamentos!$B$13:$G$42,5,0))","v":""},null,null,null,null,null,{"$f":"IF(E321=\"\",\"\",VLOOKUP(E321,Treinamentos!$B$13:$G$42,6,0))","v":""}]
[null,null,{"$f":"IF(B322=\"\",\"\",VLOOKUP(B322,Colab!$C$14:$E$63,2,0))","v":""},{"$f":"IF(B322=\"\",\"\",VLOOKUP(B322,Colab!$C$14:$E$63,3,0))","v":""},null,{"$f":"IF(E322=\"\",\"\",VLOOKUP(E322,Treinamentos!$B$13:$G$42,5,0))","v":""},null,null,null,null,null,{"$f":"IF(E322=\"\",\"\",VLOOKUP(E322,Treinamentos!$B$13:$G$42,6,0))","v":""}]
[null,null,{"$f":"IF(B323=\"\",\"\",VLOOKUP(B323,Colab!$C$14:$E$63,2,0))","v":""},{"$f":"IF(B323=\"\",\"\",VLOOKUP(B323,Colab!$C$14:$E$63,3,0))","v":""},null,{"$f":"IF(E323=\"\",\"\",VLOOKUP(E323,Treinamentos!$B$13:$G$42,5,0))","v":""},null,null,null,null,null,{"$f":"IF(E323=\"\",\"\",VLOOKUP(E323,Treinamentos!$B$13:$G$42,6,0))","v":""}]
[null,null,{"$f":"IF(B324=\"\",\"\",VLOOKUP(B324,Colab!$C$14:$E$63,2,0))","v":""},{"$f":"IF(B324=\"\",\"\",VLOOKUP(B324,Colab!$C$14:$E$63,3,0))","v":""},null,{"$f":"IF(E324=\"\",\"\",VLOOKUP(E324,Treinamentos!$B$13:$G$42,5,0))","v":""},null,null,null,null,null,{"$f":"IF(E324=\"\",\"\",VLOOKUP(E324,Treinamentos!$B$13:$G$42,6,0))","v":""}]
[null,null,{"$f":"IF(B325=\"\",\"\",VLOOKUP(B325,Colab!$C$14:$E$63,2,0))","v":""},{"$f":"IF(B325=\"\",\"\",VLOOKUP(B325,Colab!$C$14:$E$63,3,0))","v":""},null,{"$f":"IF(E325=\"\",\"\",VLOOKUP(E325,Treinamentos!$B$13:$G$42,5,0))","v":""},null,null,null,null,null,{"$f":"IF(E325=\"\",\"\",VLOOKUP(E325,Treinamentos!$B$13:$G$42,6,0))","v":""}]
[null,null,{"$f":"IF(B326=\"\",\"\",VLOOKUP(B326,Colab!$C$14:$E$63,2,0))","v":""},{"$f":"IF(B326=\"\",\"\",VLOOKUP(B326,Colab!$C$14:$E$63,3,0))","v":""},null,{"$f":"IF(E326=\"\",\"\",VLOOKUP(E326,Treinamentos!$B$13:$G$42,5,0))","v":""},null,null,null,null,null,{"$f":"IF(E326=\"\",\"\",VLOOKUP(E326,Treinamentos!$B$13:$G$42,6,0))","v":""}]
[null,null,{"$f":"IF(B327=\"\",\"\",VLOOKUP(B327,Colab!$C$14:$E$63,2,0))","v":""},{"$f":"IF(B327=\"\",\"\",VLOOKUP(B327,Colab!$C$14:$E$63,3,0))","v":""},null,{"$f":"IF(E327=\"\",\"\",VLOOKUP(E327,Treinamentos!$B$13:$G$42,5,0))","v":""},null,null,null,null,null,{"$f":"IF(E327=\"\",\"\",VLOOKUP(E327,Treinamentos!$B$13:$G$42,6,0))","v":""}]
[null,null,{"$f":"IF(B328=\"\",\"\",VLOOKUP(B328,Colab!$C$14:$E$63,2,0))","v":""},{"$f":"IF(B328=\"\",\"\",VLOOKUP(B328,Colab!$C$14:$E$63,3,0))","v":""},null,{"$f":"IF(E328=\"\",\"\",VLOOKUP(E328,Treinamentos!$B$13:$G$42,5,0))","v":""},null,null,null,null,null,{"$f":"IF(E328=\"\",\"\",VLOOKUP(E328,Treinamentos!$B$13:$G$42,6,0))","v":""}]
[null,null,{"$f":"IF(B329=\"\",\"\",VLOOKUP(B329,Colab!$C$14:$E$63,2,0))","v":""},{"$f":"IF(B329=\"\",\"\",VLOOKUP(B329,Colab!$C$14:$E$63,3,0))","v":""},null,{"$f":"IF(E329=\"\",\"\",VLOOKUP(E329,Treinamentos!$B$13:$G$42,5,0))","v":""},null,null,null,null,null,{"$f":"IF(E329=\"\",\"\",VLOOKUP(E329,Treinamentos!$B$13:$G$42,6,0))","v":""}]
[null,null,{"$f":"IF(B330=\"\",\"\",VLOOKUP(B330,Colab!$C$14:$E$63,2,0))","v":""},{"$f":"IF(B330=\"\",\"\",VLOOKUP(B330,Colab!$C$14:$E$63,3,0))","v":""},null,{"$f":"IF(E330=\"\",\"\",VLOOKUP(E330,Treinamentos!$B$13:$G$42,5,0))","v":""},null,null,null,null,null,{"$f":"IF(E330=\"\",\"\",VLOOKUP(E330,Treinamentos!$B$13:$G$42,6,0))","v":""}]
[null,null,{"$f":"IF(B331=\"\",\"\",VLOOKUP(B331,Colab!$C$14:$E$63,2,0))","v":""},{"$f":"IF(B331=\"\",\"\",VLOOKUP(B331,Colab!$C$14:$E$63,3,0))","v":""},null,{"$f":"IF(E331=\"\",\"\",VLOOKUP(E331,Treinamentos!$B$13:$G$42,5,0))","v":""},null,null,null,null,null,{"$f":"IF(E331=\"\",\"\",VLOOKUP(E331,Treinamentos!$B$13:$G$42,6,0))","v":""}]
[null,null,{"$f":"IF(B332=\"\",\"\",VLOOKUP(B332,Colab!$C$14:$E$63,2,0))","v":""},{"$f":"IF(B332=\"\",\"\",VLOOKUP(B332,Colab!$C$14:$E$63,3,0))","v":""},null,{"$f":"IF(E332=\"\",\"\",VLOOKUP(E332,Treinamentos!$B$13:$G$42,5,0))","v":""},null,null,null,null,null,{"$f":"IF(E332=\"\",\"\",VLOOKUP(E332,Treinamentos!$B$13:$G$42,6,0))","v":""}]
[null,null,{"$f":"IF(B333=\"\",\"\",VLOOKUP(B333,Colab!$C$14:$E$63,2,0))","v":""},{"$f":"IF(B333=\"\",\"\",VLOOKUP(B333,Colab!$C$14:$E$63,3,0))","v":""},null,{"$f":"IF(E333=\"\",\"\",VLOOKUP(E333,Treinamentos!$B$13:$G$42,5,0))","v":""},null,null,null,null,null,{"$f":"IF(E333=\"\",\"\",VLOOKUP(E333,Treinamentos!$B$13:$G$42,6,0))","v":""}]
[null,null,{"$f":"IF(B334=\"\",\"\",VLOOKUP(B334,Colab!$C$14:$E$63,2,0))","v":""},{"$f":"IF(B334=\"\",\"\",VLOOKUP(B334,Colab!$C$14:$E$63,3,0))","v":""},null,{"$f":"IF(E334=\"\",\"\",VLOOKUP(E334,Treinamentos!$B$13:$G$42,5,0))","v":""},null,null,null,null,null,{"$f":"IF(E334=\"\",\"\",VLOOKUP(E334,Treinamentos!$B$13:$G$42,6,0))","v":""}]
[null,null,{"$f":"IF(B335=\"\",\"\",VLOOKUP(B335,Colab!$C$14:$E$63,2,0))","v":""},{"$f":"IF(B335=\"\",\"\",VLOOKUP(B335,Colab!$C$14:$E$63,3,0))","v":""},null,{"$f":"IF(E335=\"\",\"\",VLOOKUP(E335,Treinamentos!$B$13:$G$42,5,0))","v":""},null,null,null,null,null,{"$f":"IF(E335=\"\",\"\",VLOOKUP(E335,Treinamentos!$B$13:$G$42,6,0))","v":""}]
[null,null,{"$f":"IF(B336=\"\",\"\",VLOOKUP(B336,Colab!$C$14:$E$63,2,0))","v":""},{"$f":"IF(B336=\"\",\"\",VLOOKUP(B336,Colab!$C$14:$E$63,3,0))","v":""},null,{"$f":"IF(E336=\"\",\"\",VLOOKUP(E336,Treinamentos!$B$13:$G$42,5,0))","v":""},null,null,null,null,null,{"$f":"IF(E336=\"\",\"\",VLOOKUP(E336,Treinamentos!$B$13:$G$42,6,0))","v":""}]
[null,null,{"$f":"IF(B337=\"\",\"\",VLOOKUP(B337,Colab!$C$14:$E$63,2,0))","v":""},{"$f":"IF(B337=\"\",\"\",VLOOKUP(B337,Colab!$C$14:$E$63,3,0))","v":""},null,{"$f":"IF(E337=\"\",\"\",VLOOKUP(E337,Treinamentos!$B$13:$G$42,5,0))","v":""},null,null,null,null,null,{"$f":"IF(E337=\"\",\"\",VLOOKUP(E337,Treinamentos!$B$13:$G$42,6,0))","v":""}]
[null,null,{"$f":"IF(B338=\"\",\"\",VLOOKUP(B338,Colab!$C$14:$E$63,2,0))","v":""},{"$f":"IF(B338=\"\",\"\",VLOOKUP(B338,Colab!$C$14:$E$63,3,0))","v":""},null,{"$f":"IF(E338=\"\",\"\",VLOOKUP(E338,Treinamentos!$B$13:$G$42,5,0))","v":""},null,null,null,null,null,{"$f":"IF(E338=\"\",\"\",VLOOKUP(E338,Treinamentos!$B$13:$G$42,6,0))","v":""}]
[null,null,{"$f":"IF(B339=\"\",\"\",VLOOKUP(B339,Colab!$C$14:$E$63,2,0))","v":""},{"$f":"IF(B339=\"\",\"\",VLOOKUP(B339,Colab!$C$14:$E$63,3,0))","v":""},null,{"$f":"IF(E339=\"\",\"\",VLOOKUP(E339,Treinamentos!$B$13:$G$42,5,0))","v":""},null,null,null,null,null,{"$f":"IF(E339=\"\",\"\",VLOOKUP(E339,Treinamentos!$B$13:$G$42,6,0))","v":""}]
[null,null,{"$f":"IF(B340=\"\",\"\",VLOOKUP(B340,Colab!$C$14:$E$63,2,0))","v":""},{"$f":"IF(B340=\"\",\"\",VLOOKUP(B340,Colab!$C$14:$E$63,3,0))","v":""},null,{"$f":"IF(E340=\"\",\"\",VLOOKUP(E340,Treinamentos!$B$13:$G$42,5,0))","v":""},null,null,null,null,null,{"$f":"IF(E340=\"\",\"\",VLOOKUP(E340,Treinamentos!$B$13:$G$42,6,0))","v":""}]
[null,null,{"$f":"IF(B341=\"\",\"\",VLOOKUP(B341,Colab!$C$14:$E$63,2,0))","v":""},{"$f":"IF(B341=\"\",\"\",VLOOKUP(B341,Colab!$C$14:$E$63,3,0))","v":""},null,{"$f":"IF(E341=\"\",\"\",VLOOKUP(E341,Treinamentos!$B$13:$G$42,5,0))","v":""},null,null,null,null,null,{"$f":"IF(E341=\"\",\"\",VLOOKUP(E341,Treinamentos!$B$13:$G$42,6,0))","v":""}]
[null,null,{"$f":"IF(B342=\"\",\"\",VLOOKUP(B342,Colab!$C$14:$E$63,2,0))","v":""},{"$f":"IF(B342=\"\",\"\",VLOOKUP(B342,Colab!$C$14:$E$63,3,0))","v":""},null,{"$f":"IF(E342=\"\",\"\",VLOOKUP(E342,Treinamentos!$B$13:$G$42,5,0))","v":""},null,null,null,null,null,{"$f":"IF(E342=\"\",\"\",VLOOKUP(E342,Treinamentos!$B$13:$G$42,6,0))","v":""}]
[null,null,{"$f":"IF(B343=\"\",\"\",VLOOKUP(B343,Colab!$C$14:$E$63,2,0))","v":""},{"$f":"IF(B343=\"\",\"\",VLOOKUP(B343,Colab!$C$14:$E$63,3,0))","v":""},null,{"$f":"IF(E343=\"\",\"\",VLOOKUP(E343,Treinamentos!$B$13:$G$42,5,0))","v":""},null,null,null,null,null,{"$f":"IF(E343=\"\",\"\",VLOOKUP(E343,Treinamentos!$B$13:$G$42,6,0))","v":""}]
[null,null,{"$f":"IF(B344=\"\",\"\",VLOOKUP(B344,Colab!$C$14:$E$63,2,0))","v":""},{"$f":"IF(B344=\"\",\"\",VLOOKUP(B344,Colab!$C$14:$E$63,3,0))","v":""},null,{"$f":"IF(E344=\"\",\"\",VLOOKUP(E344,Treinamentos!$B$13:$G$42,5,0))","v":""},null,null,null,null,null,{"$f":"IF(E344=\"\",\"\",VLOOKUP(E344,Treinamentos!$B$13:$G$42,6,0))","v":""}]
[null,null,{"$f":"IF(B345=\"\",\"\",VLOOKUP(B345,Colab!$C$14:$E$63,2,0))","v":""},{"$f":"IF(B345=\"\",\"\",VLOOKUP(B345,Colab!$C$14:$E$63,3,0))","v":""},null,{"$f":"IF(E345=\"\",\"\",VLOOKUP(E345,Treinamentos!$B$13:$G$42,5,0))","v":""},null,null,null,null,null,{"$f":"IF(E345=\"\",\"\",VLOOKUP(E345,Treinamentos!$B$13:$G$42,6,0))","v":""}]
[null,null,{"$f":"IF(B346=\"\",\"\",VLOOKUP(B346,Colab!$C$14:$E$63,2,0))","v":""},{"$f":"IF(B346=\"\",\"\",VLOOKUP(B346,Colab!$C$14:$E$63,3,0))","v":""},null,{"$f":"IF(E346=\"\",\"\",VLOOKUP(E346,Treinamentos!$B$13:$G$42,5,0))","v":""},null,null,null,null,null,{"$f":"IF(E346=\"\",\"\",VLOOKUP(E346,Treinamentos!$B$13:$G$42,6,0))","v":""}]
[null,null,{"$f":"IF(B347=\"\",\"\",VLOOKUP(B347,Colab!$C$14:$E$63,2,0))","v":""},{"$f":"IF(B347=\"\",\"\",VLOOKUP(B347,Colab!$C$14:$E$63,3,0))","v":""},null,{"$f":"IF(E347=\"\",\"\",VLOOKUP(E347,Treinamentos!$B$13:$G$42,5,0))","v":""},null,null,null,null,null,{"$f":"IF(E347=\"\",\"\",VLOOKUP(E347,Treinamentos!$B$13:$G$42,6,0))","v":""}]
[null,null,{"$f":"IF(B348=\"\",\"\",VLOOKUP(B348,Colab!$C$14:$E$63,2,0))","v":""},{"$f":"IF(B348=\"\",\"\",VLOOKUP(B348,Colab!$C$14:$E$63,3,0))","v":""},null,{"$f":"IF(E348=\"\",\"\",VLOOKUP(E348,Treinamentos!$B$13:$G$42,5,0))","v":""},null,null,null,null,null,{"$f":"IF(E348=\"\",\"\",VLOOKUP(E348,Treinamentos!$B$13:$G$42,6,0))","v":""}]
[null,null,{"$f":"IF(B349=\"\",\"\",VLOOKUP(B349,Colab!$C$14:$E$63,2,0))","v":""},{"$f":"IF(B349=\"\",\"\",VLOOKUP(B349,Colab!$C$14:$E$63,3,0))","v":""},null,{"$f":"IF(E349=\"\",\"\",VLOOKUP(E349,Treinamentos!$B$13:$G$42,5,0))","v":""},null,null,null,null,null,{"$f":"IF(E349=\"\",\"\",VLOOKUP(E349,Treinamentos!$B$13:$G$42,6,0))","v":""}]
[null,null,{"$f":"IF(B350=\"\",\"\",VLOOKUP(B350,Colab!$C$14:$E$63,2,0))","v":""},{"$f":"IF(B350=\"\",\"\",VLOOKUP(B350,Colab!$C$14:$E$63,3,0))","v":""},null,{"$f":"IF(E350=\"\",\"\",VLOOKUP(E350,Treinamentos!$B$13:$G$42,5,0))","v":""},null,null,null,null,null,{"$f":"IF(E350=\"\",\"\",VLOOKUP(E350,Treinamentos!$B$13:$G$42,6,0))","v":""}]
[null,null,{"$f":"IF(B351=\"\",\"\",VLOOKUP(B351,Colab!$C$14:$E$63,2,0))","v":""},{"$f":"IF(B351=\"\",\"\",VLOOKUP(B351,Colab!$C$14:$E$63,3,0))","v":""},null,{"$f":"IF(E351=\"\",\"\",VLOOKUP(E351,Treinamentos!$B$13:$G$42,5,0))","v":""},null,null,null,null,null,{"$f":"IF(E351=\"\",\"\",VLOOKUP(E351,Treinamentos!$B$13:$G$42,6,0))","v":""}]
[null,null,{"$f":"IF(B352=\"\",\"\",VLOOKUP(B352,Colab!$C$14:$E$63,2,0))","v":""},{"$f":"IF(B352=\"\",\"\",VLOOKUP(B352,Colab!$C$14:$E$63,3,0))","v":""},null,{"$f":"IF(E352=\"\",\"\",VLOOKUP(E352,Treinamentos!$B$13:$G$42,5,0))","v":""},null,null,null,null,null,{"$f":"IF(E352=\"\",\"\",VLOOKUP(E352,Treinamentos!$B$13:$G$42,6,0))","v":""}]
[null,null,{"$f":"IF(B353=\"\",\"\",VLOOKUP(B353,Colab!$C$14:$E$63,2,0))","v":""},{"$f":"IF(B353=\"\",\"\",VLOOKUP(B353,Colab!$C$14:$E$63,3,0))","v":""},null,{"$f":"IF(E353=\"\",\"\",VLOOKUP(E353,Treinamentos!$B$13:$G$42,5,0))","v":""},null,null,null,null,null,{"$f":"IF(E353=\"\",\"\",VLOOKUP(E353,Treinamentos!$B$13:$G$42,6,0))","v":""}]
[null,null,{"$f":"IF(B354=\"\",\"\",VLOOKUP(B354,Colab!$C$14:$E$63,2,0))","v":""},{"$f":"IF(B354=\"\",\"\",VLOOKUP(B354,Colab!$C$14:$E$63,3,0))","v":""},null,{"$f":"IF(E354=\"\",\"\",VLOOKUP(E354,Treinamentos!$B$13:$G$42,5,0))","v":""},null,null,null,null,null,{"$f":"IF(E354=\"\",\"\",VLOOKUP(E354,Treinamentos!$B$13:$G$42,6,0))","v":""}]
[null,null,{"$f":"IF(B355=\"\",\"\",VLOOKUP(B355,Colab!$C$14:$E$63,2,0))","v":""},{"$f":"IF(B355=\"\",\"\",VLOOKUP(B355,Colab!$C$14:$E$63,3,0))","v":""},null,{"$f":"IF(E355=\"\",\"\",VLOOKUP(E355,Treinamentos!$B$13:$G$42,5,0))","v":""},null,null,null,null,null,{"$f":"IF(E355=\"\",\"\",VLOOKUP(E355,Treinamentos!$B$13:$G$42,6,0))","v":""}]
[null,null,{"$f":"IF(B356=\"\",\"\",VLOOKUP(B356,Colab!$C$14:$E$63,2,0))","v":""},{"$f":"IF(B356=\"\",\"\",VLOOKUP(B356,Colab!$C$14:$E$63,3,0))","v":""},null,{"$f":"IF(E356=\"\",\"\",VLOOKUP(E356,Treinamentos!$B$13:$G$42,5,0))","v":""},null,null,null,null,null,{"$f":"IF(E356=\"\",\"\",VLOOKUP(E356,Treinamentos!$B$13:$G$42,6,0))","v":""}]
[null,null,{"$f":"IF(B357=\"\",\"\",VLOOKUP(B357,Colab!$C$14:$E$63,2,0))","v":""},{"$f":"IF(B357=\"\",\"\",VLOOKUP(B357,Colab!$C$14:$E$63,3,0))","v":""},null,{"$f":"IF(E357=\"\",\"\",VLOOKUP(E357,Treinamentos!$B$13:$G$42,5,0))","v":""},null,null,null,null,null,{"$f":"IF(E357=\"\",\"\",VLOOKUP(E357,Treinamentos!$B$13:$G$42,6,0))","v":""}]
[null,null,{"$f":"IF(B358=\"\",\"\",VLOOKUP(B358,Colab!$C$14:$E$63,2,0))","v":""},{"$f":"IF(B358=\"\",\"\",VLOOKUP(B358,Colab!$C$14:$E$63,3,0))","v":""},null,{"$f":"IF(E358=\"\",\"\",VLOOKUP(E358,Treinamentos!$B$13:$G$42,5,0))","v":""},null,null,null,null,null,{"$f":"IF(E358=\"\",\"\",VLOOKUP(E358,Treinamentos!$B$13:$G$42,6,0))","v":""}]
[null,null,{"$f":"IF(B359=\"\",\"\",VLOOKUP(B359,Colab!$C$14:$E$63,2,0))","v":""},{"$f":"IF(B359=\"\",\"\",VLOOKUP(B359,Colab!$C$14:$E$63,3,0))","v":""},null,{"$f":"IF(E359=\"\",\"\",VLOOKUP(E359,Treinamentos!$B$13:$G$42,5,0))","v":""},null,null,null,null,null,{"$f":"IF(E359=\"\",\"\",VLOOKUP(E359,Treinamentos!$B$13:$G$42,6,0))","v":""}]
[null,null,{"$f":"IF(B360=\"\",\"\",VLOOKUP(B360,Colab!$C$14:$E$63,2,0))","v":""},{"$f":"IF(B360=\"\",\"\",VLOOKUP(B360,Colab!$C$14:$E$63,3,0))","v":""},null,{"$f":"IF(E360=\"\",\"\",VLOOKUP(E360,Treinamentos!$B$13:$G$42,5,0))","v":""},null,null,null,null,null,{"$f":"IF(E360=\"\",\"\",VLOOKUP(E360,Treinamentos!$B$13:$G$42,6,0))","v":""}]
[null,null,{"$f":"IF(B361=\"\",\"\",VLOOKUP(B361,Colab!$C$14:$E$63,2,0))","v":""},{"$f":"IF(B361=\"\",\"\",VLOOKUP(B361,Colab!$C$14:$E$63,3,0))","v":""},null,{"$f":"IF(E361=\"\",\"\",VLOOKUP(E361,Treinamentos!$B$13:$G$42,5,0))","v":""},null,null,null,null,null,{"$f":"IF(E361=\"\",\"\",VLOOKUP(E361,Treinamentos!$B$13:$G$42,6,0))","v":""}]
[null,null,{"$f":"IF(B362=\"\",\"\",VLOOKUP(B362,Colab!$C$14:$E$63,2,0))","v":""},{"$f":"IF(B362=\"\",\"\",VLOOKUP(B362,Colab!$C$14:$E$63,3,0))","v":""},null,{"$f":"IF(E362=\"\",\"\",VLOOKUP(E362,Treinamentos!$B$13:$G$42,5,0))","v":""},null,null,null,null,null,{"$f":"IF(E362=\"\",\"\",VLOOKUP(E362,Treinamentos!$B$13:$G$42,6,0))","v":""}]
[null,null,{"$f":"IF(B363=\"\",\"\",VLOOKUP(B363,Colab!$C$14:$E$63,2,0))","v":""},{"$f":"IF(B363=\"\",\"\",VLOOKUP(B363,Colab!$C$14:$E$63,3,0))","v":""},null,{"$f":"IF(E363=\"\",\"\",VLOOKUP(E363,Treinamentos!$B$13:$G$42,5,0))","v":""},null,null,null,null,null,{"$f":"IF(E363=\"\",\"\",VLOOKUP(E363,Treinamentos!$B$13:$G$42,6,0))","v":""}]
[null,null,{"$f":"IF(B364=\"\",\"\",VLOOKUP(B364,Colab!$C$14:$E$63,2,0))","v":""},{"$f":"IF(B364=\"\",\"\",VLOOKUP(B364,Colab!$C$14:$E$63,3,0))","v":""},null,{"$f":"IF(E364=\"\",\"\",VLOOKUP(E364,Treinamentos!$B$13:$G$42,5,0))","v":""},null,null,null,null,null,{"$f":"IF(E364=\"\",\"\",VLOOKUP(E364,Treinamentos!$B$13:$G$42,6,0))","v":""}]
[null,null,{"$f":"IF(B365=\"\",\"\",VLOOKUP(B365,Colab!$C$14:$E$63,2,0))","v":""},{"$f":"IF(B365=\"\",\"\",VLOOKUP(B365,Colab!$C$14:$E$63,3,0))","v":""},null,{"$f":"IF(E365=\"\",\"\",VLOOKUP(E365,Treinamentos!$B$13:$G$42,5,0))","v":""},null,null,null,null,null,{"$f":"IF(E365=\"\",\"\",VLOOKUP(E365,Treinamentos!$B$13:$G$42,6,0))","v":""}]
[null,null,{"$f":"IF(B366=\"\",\"\",VLOOKUP(B366,Colab!$C$14:$E$63,2,0))","v":""},{"$f":"IF(B366=\"\",\"\",VLOOKUP(B366,Colab!$C$14:$E$63,3,0))","v":""},null,{"$f":"IF(E366=\"\",\"\",VLOOKUP(E366,Treinamentos!$B$13:$G$42,5,0))","v":""},null,null,null,null,null,{"$f":"IF(E366=\"\",\"\",VLOOKUP(E366,Treinamentos!$B$13:$G$42,6,0))","v":""}]
[null,null,{"$f":"IF(B367=\"\",\"\",VLOOKUP(B367,Colab!$C$14:$E$63,2,0))","v":""},{"$f":"IF(B367=\"\",\"\",VLOOKUP(B367,Colab!$C$14:$E$63,3,0))","v":""},null,{"$f":"IF(E367=\"\",\"\",VLOOKUP(E367,Treinamentos!$B$13:$G$42,5,0))","v":""},null,null,null,null,null,{"$f":"IF(E367=\"\",\"\",VLOOKUP(E367,Treinamentos!$B$13:$G$42,6,0))","v":""}]
[null,null,{"$f":"IF(B368=\"\",\"\",VLOOKUP(B368,Colab!$C$14:$E$63,2,0))","v":""},{"$f":"IF(B368=\"\",\"\",VLOOKUP(B368,Colab!$C$14:$E$63,3,0))","v":""},null,{"$f":"IF(E368=\"\",\"\",VLOOKUP(E368,Treinamentos!$B$13:$G$42,5,0))","v":""},null,null,null,null,null,{"$f":"IF(E368=\"\",\"\",VLOOKUP(E368,Treinamentos!$B$13:$G$42,6,0))","v":""}]
[null,null,{"$f":"IF(B369=\"\",\"\",VLOOKUP(B369,Colab!$C$14:$E$63,2,0))","v":""},{"$f":"IF(B369=\"\",\"\",VLOOKUP(B369,Colab!$C$14:$E$63,3,0))","v":""},null,{"$f":"IF(E369=\"\",\"\",VLOOKUP(E369,Treinamentos!$B$13:$G$42,5,0))","v":""},null,null,null,null,null,{"$f":"IF(E369=\"\",\"\",VLOOKUP(E369,Treinamentos!$B$13:$G$42,6,0))","v":""}]
[null,null,{"$f":"IF(B370=\"\",\"\",VLOOKUP(B370,Colab!$C$14:$E$63,2,0))","v":""},{"$f":"IF(B370=\"\",\"\",VLOOKUP(B370,Colab!$C$14:$E$63,3,0))","v":""},null,{"$f":"IF(E370=\"\",\"\",VLOOKUP(E370,Treinamentos!$B$13:$G$42,5,0))","v":""},null,null,null,null,null,{"$f":"IF(E370=\"\",\"\",VLOOKUP(E370,Treinamentos!$B$13:$G$42,6,0))","v":""}]
[null,null,{"$f":"IF(B371=\"\",\"\",VLOOKUP(B371,Colab!$C$14:$E$63,2,0))","v":""},{"$f":"IF(B371=\"\",\"\",VLOOKUP(B371,Colab!$C$14:$E$63,3,0))","v":""},null,{"$f":"IF(E371=\"\",\"\",VLOOKUP(E371,Treinamentos!$B$13:$G$42,5,0))","v":""},null,null,null,null,null,{"$f":"IF(E371=\"\",\"\",VLOOKUP(E371,Treinamentos!$B$13:$G$42,6,0))","v":""}]
[null,null,{"$f":"IF(B372=\"\",\"\",VLOOKUP(B372,Colab!$C$14:$E$63,2,0))","v":""},{"$f":"IF(B372=\"\",\"\",VLOOKUP(B372,Colab!$C$14:$E$63,3,0))","v":""},null,{"$f":"IF(E372=\"\",\"\",VLOOKUP(E372,Treinamentos!$B$13:$G$42,5,0))","v":""},null,null,null,null,null,{"$f":"IF(E372=\"\",\"\",VLOOKUP(E372,Treinamentos!$B$13:$G$42,6,0))","v":""}]
[null,null,{"$f":"IF(B373=\"\",\"\",VLOOKUP(B373,Colab!$C$14:$E$63,2,0))","v":""},{"$f":"IF(B373=\"\",\"\",VLOOKUP(B373,Colab!$C$14:$E$63,3,0))","v":""},null,{"$f":"IF(E373=\"\",\"\",VLOOKUP(E373,Treinamentos!$B$13:$G$42,5,0))","v":""},null,null,null,null,null,{"$f":"IF(E373=\"\",\"\",VLOOKUP(E373,Treinamentos!$B$13:$G$42,6,0))","v":""}]
[null,null,{"$f":"IF(B374=\"\",\"\",VLOOKUP(B374,Colab!$C$14:$E$63,2,0))","v":""},{"$f":"IF(B374=\"\",\"\",VLOOKUP(B374,Colab!$C$14:$E$63,3,0))","v":""},null,{"$f":"IF(E374=\"\",\"\",VLOOKUP(E374,Treinamentos!$B$13:$G$42,5,0))","v":""},null,null,null,null,null,{"$f":"IF(E374=\"\",\"\",VLOOKUP(E374,Treinamentos!$B$13:$G$42,6,0))","v":""}]
[null,null,{"$f":"IF(B375=\"\",\"\",VLOOKUP(B375,Colab!$C$14:$E$63,2,0))","v":""},{"$f":"IF(B375=\"\",\"\",VLOOKUP(B375,Colab!$C$14:$E$63,3,0))","v":""},null,{"$f":"IF(E375=\"\",\"\",VLOOKUP(E375,Treinamentos!$B$13:$G$42,5,0))","v":""},null,null,null,null,null,{"$f":"IF(E375=\"\",\"\",VLOOKUP(E375,Treinamentos!$B$13:$G$42,6,0))","v":""}]
[null,null,{"$f":"IF(B376=\"\",\"\",VLOOKUP(B376,Colab!$C$14:$E$63,2,0))","v":""},{"$f":"IF(B376=\"\",\"\",VLOOKUP(B376,Colab!$C$14:$E$63,3,0))","v":""},null,{"$f":"IF(E376=\"\",\"\",VLOOKUP(E376,Treinamentos!$B$13:$G$42,5,0))","v":""},null,null,null,null,null,{"$f":"IF(E376=\"\",\"\",VLOOKUP(E376,Treinamentos!$B$13:$G$42,6,0))","v":""}]
[null,null,{"$f":"IF(B377=\"\",\"\",VLOOKUP(B377,Colab!$C$14:$E$63,2,0))","v":""},{"$f":"IF(B377=\"\",\"\",VLOOKUP(B377,Colab!$C$14:$E$63,3,0))","v":""},null,{"$f":"IF(E377=\"\",\"\",VLOOKUP(E377,Treinamentos!$B$13:$G$42,5,0))","v":""},null,null,null,null,null,{"$f":"IF(E377=\"\",\"\",VLOOKUP(E377,Treinamentos!$B$13:$G$42,6,0))","v":""}]
[null,null,{"$f":"IF(B378=\"\",\"\",VLOOKUP(B378,Colab!$C$14:$E$63,2,0))","v":""},{"$f":"IF(B378=\"\",\"\",VLOOKUP(B378,Colab!$C$14:$E$63,3,0))","v":""},null,{"$f":"IF(E378=\"\",\"\",VLOOKUP(E378,Treinamentos!$B$13:$G$42,5,0))","v":""},null,null,null,null,null,{"$f":"IF(E378=\"\",\"\",VLOOKUP(E378,Treinamentos!$B$13:$G$42,6,0))","v":""}]
[null,null,{"$f":"IF(B379=\"\",\"\",VLOOKUP(B379,Colab!$C$14:$E$63,2,0))","v":""},{"$f":"IF(B379=\"\",\"\",VLOOKUP(B379,Colab!$C$14:$E$63,3,0))","v":""},null,{"$f":"IF(E379=\"\",\"\",VLOOKUP(E379,Treinamentos!$B$13:$G$42,5,0))","v":""},null,null,null,null,null,{"$f":"IF(E379=\"\",\"\",VLOOKUP(E379,Treinamentos!$B$13:$G$42,6,0))","v":""}]
[null,null,{"$f":"IF(B380=\"\",\"\",VLOOKUP(B380,Colab!$C$14:$E$63,2,0))","v":""},{"$f":"IF(B380=\"\",\"\",VLOOKUP(B380,Colab!$C$14:$E$63,3,0))","v":""},null,{"$f":"IF(E380=\"\",\"\",VLOOKUP(E380,Treinamentos!$B$13:$G$42,5,0))","v":""},null,null,null,null,null,{"$f":"IF(E380=\"\",\"\",VLOOKUP(E380,Treinamentos!$B$13:$G$42,6,0))","v":""}]
[null,null,{"$f":"IF(B381=\"\",\"\",VLOOKUP(B381,Colab!$C$14:$E$63,2,0))","v":""},{"$f":"IF(B381=\"\",\"\",VLOOKUP(B381,Colab!$C$14:$E$63,3,0))","v":""},null,{"$f":"IF(E381=\"\",\"\",VLOOKUP(E381,Treinamentos!$B$13:$G$42,5,0))","v":""},null,null,null,null,null,{"$f":"IF(E381=\"\",\"\",VLOOKUP(E381,Treinamentos!$B$13:$G$42,6,0))","v":""}]
[null,null,{"$f":"IF(B382=\"\",\"\",VLOOKUP(B382,Colab!$C$14:$E$63,2,0))","v":""},{"$f":"IF(B382=\"\",\"\",VLOOKUP(B382,Colab!$C$14:$E$63,3,0))","v":""},null,{"$f":"IF(E382=\"\",\"\",VLOOKUP(E382,Treinamentos!$B$13:$G$42,5,0))","v":""},null,null,null,null,null,{"$f":"IF(E382=\"\",\"\",VLOOKUP(E382,Treinamentos!$B$13:$G$42,6,0))","v":""}]
[null,null,{"$f":"IF(B383=\"\",\"\",VLOOKUP(B383,Colab!$C$14:$E$63,2,0))","v":""},{"$f":"IF(B383=\"\",\"\",VLOOKUP(B383,Colab!$C$14:$E$63,3,0))","v":""},null,{"$f":"IF(E383=\"\",\"\",VLOOKUP(E383,Treinamentos!$B$13:$G$42,5,0))","v":""},null,null,null,null,null,{"$f":"IF(E383=\"\",\"\",VLOOKUP(E383,Treinamentos!$B$13:$G$42,6,0))","v":""}]
[null,null,{"$f":"IF(B384=\"\",\"\",VLOOKUP(B384,Colab!$C$14:$E$63,2,0))","v":""},{"$f":"IF(B384=\"\",\"\",VLOOKUP(B384,Colab!$C$14:$E$63,3,0))","v":""},null,{"$f":"IF(E384=\"\",\"\",VLOOKUP(E384,Treinamentos!$B$13:$G$42,5,0))","v":""},null,null,null,null,null,{"$f":"IF(E384=\"\",\"\",VLOOKUP(E384,Treinamentos!$B$13:$G$42,6,0))","v":""}]
[null,null,{"$f":"IF(B385=\"\",\"\",VLOOKUP(B385,Colab!$C$14:$E$63,2,0))","v":""},{"$f":"IF(B385=\"\",\"\",VLOOKUP(B385,Colab!$C$14:$E$63,3,0))","v":""},null,{"$f":"IF(E385=\"\",\"\",VLOOKUP(E385,Treinamentos!$B$13:$G$42,5,0))","v":""},null,null,null,null,null,{"$f":"IF(E385=\"\",\"\",VLOOKUP(E385,Treinamentos!$B$13:$G$42,6,0))","v":""}]
[null,null,{"$f":"IF(B386=\"\",\"\",VLOOKUP(B386,Colab!$C$14:$E$63,2,0))","v":""},{"$f":"IF(B386=\"\",\"\",VLOOKUP(B386,Colab!$C$14:$E$63,3,0))","v":""},null,{"$f":"IF(E386=\"\",\"\",VLOOKUP(E386,Treinamentos!$B$13:$G$42,5,0))","v":""},null,null,null,null,null,{"$f":"IF(E386=\"\",\"\",VLOOKUP(E386,Treinamentos!$B$13:$G$42,6,0))","v":""}]
[null,null,{"$f":"IF(B387=\"\",\"\",VLOOKUP(B387,Colab!$C$14:$E$63,2,0))","v":""},{"$f":"IF(B387=\"\",\"\",VLOOKUP(B387,Colab!$C$14:$E$63,3,0))","v":""},null,{"$f":"IF(E387=\"\",\"\",VLOOKUP(E387,Treinamentos!$B$13:$G$42,5,0))","v":""},null,null,null,null,null,{"$f":"IF(E387=\"\",\"\",VLOOKUP(E387,Treinamentos!$B$13:$G$42,6,0))","v":""}]
[null,null,{"$f":"IF(B388=\"\",\"\",VLOOKUP(B388,Colab!$C$14:$E$63,2,0))","v":""},{"$f":"IF(B388=\"\",\"\",VLOOKUP(B388,Colab!$C$14:$E$63,3,0))","v":""},null,{"$f":"IF(E388=\"\",\"\",VLOOKUP(E388,Treinamentos!$B$13:$G$42,5,0))","v":""},null,null,null,null,null,{"$f":"IF(E388=\"\",\"\",VLOOKUP(E388,Treinamentos!$B$13:$G$42,6,0))","v":""}]
[null,null,{"$f":"IF(B389=\"\",\"\",VLOOKUP(B389,Colab!$C$14:$E$63,2,0))","v":""},{"$f":"IF(B389=\"\",\"\",VLOOKUP(B389,Colab!$C$14:$E$63,3,0))","v":""},null,{"$f":"IF(E389=\"\",\"\",VLOOKUP(E389,Treinamentos!$B$13:$G$42,5,0))","v":""},null,null,null,null,null,{"$f":"IF(E389=\"\",\"\",VLOOKUP(E389,Treinamentos!$B$13:$G$42,6,0))","v":""}]
[null,null,{"$f":"IF(B390=\"\",\"\",VLOOKUP(B390,Colab!$C$14:$E$63,2,0))","v":""},{"$f":"IF(B390=\"\",\"\",VLOOKUP(B390,Colab!$C$14:$E$63,3,0))","v":""},null,{"$f":"IF(E390=\"\",\"\",VLOOKUP(E390,Treinamentos!$B$13:$G$42,5,0))","v":""},null,null,null,null,null,{"$f":"IF(E390=\"\",\"\",VLOOKUP(E390,Treinamentos!$B$13:$G$42,6,0))","v":""}]
[null,null,{"$f":"IF(B391=\"\",\"\",VLOOKUP(B391,Colab!$C$14:$E$63,2,0))","v":""},{"$f":"IF(B391=\"\",\"\",VLOOKUP(B391,Colab!$C$14:$E$63,3,0))","v":""},null,{"$f":"IF(E391=\"\",\"\",VLOOKUP(E391,Treinamentos!$B$13:$G$42,5,0))","v":""},null,null,null,null,null,{"$f":"IF(E391=\"\",\"\",VLOOKUP(E391,Treinamentos!$B$13:$G$42,6,0))","v":""}]
[null,null,{"$f":"IF(B392=\"\",\"\",VLOOKUP(B392,Colab!$C$14:$E$63,2,0))","v":""},{"$f":"IF(B392=\"\",\"\",VLOOKUP(B392,Colab!$C$14:$E$63,3,0))","v":""},null,{"$f":"IF(E392=\"\",\"\",VLOOKUP(E392,Treinamentos!$B$13:$G$42,5,0))","v":""},null,null,null,null,null,{"$f":"IF(E392=\"\",\"\",VLOOKUP(E392,Treinamentos!$B$13:$G$42,6,0))","v":""}]
[null,null,{"$f":"IF(B393=\"\",\"\",VLOOKUP(B393,Colab!$C$14:$E$63,2,0))","v":""},{"$f":"IF(B393=\"\",\"\",VLOOKUP(B393,Colab!$C$14:$E$63,3,0))","v":""},null,{"$f":"IF(E393=\"\",\"\",VLOOKUP(E393,Treinamentos!$B$13:$G$42,5,0))","v":""},null,null,null,null,null,{"$f":"IF(E393=\"\",\"\",VLOOKUP(E393,Treinamentos!$B$13:$G$42,6,0))","v":""}]
[null,null,{"$f":"IF(B394=\"\",\"\",VLOOKUP(B394,Colab!$C$14:$E$63,2,0))","v":""},{"$f":"IF(B394=\"\",\"\",VLOOKUP(B394,Colab!$C$14:$E$63,3,0))","v":""},null,{"$f":"IF(E394=\"\",\"\",VLOOKUP(E394,Treinamentos!$B$13:$G$42,5,0))","v":""},null,null,null,null,null,{"$f":"IF(E394=\"\",\"\",VLOOKUP(E394,Treinamentos!$B$13:$G$42,6,0))","v":""}]
[null,null,{"$f":"IF(B395=\"\",\"\",VLOOKUP(B395,Colab!$C$14:$E$63,2,0))","v":""},{"$f":"IF(B395=\"\",\"\",VLOOKUP(B395,Colab!$C$14:$E$63,3,0))","v":""},null,{"$f":"IF(E395=\"\",\"\",VLOOKUP(E395,Treinamentos!$B$13:$G$42,5,0))","v":""},null,null,null,null,null,{"$f":"IF(E395=\"\",\"\",VLOOKUP(E395,Treinamentos!$B$13:$G$42,6,0))","v":""}]
[null,null,{"$f":"IF(B396=\"\",\"\",VLOOKUP(B396,Colab!$C$14:$E$63,2,0))","v":""},{"$f":"IF(B396=\"\",\"\",VLOOKUP(B396,Colab!$C$14:$E$63,3,0))","v":""},null,{"$f":"IF(E396=\"\",\"\",VLOOKUP(E396,Treinamentos!$B$13:$G$42,5,0))","v":""},null,null,null,null,null,{"$f":"IF(E396=\"\",\"\",VLOOKUP(E396,Treinamentos!$B$13:$G$42,6,0))","v":""}]
[null,null,{"$f":"IF(B397=\"\",\"\",VLOOKUP(B397,Colab!$C$14:$E$63,2,0))","v":""},{"$f":"IF(B397=\"\",\"\",VLOOKUP(B397,Colab!$C$14:$E$63,3,0))","v":""},null,{"$f":"IF(E397=\"\",\"\",VLOOKUP(E397,Treinamentos!$B$13:$G$42,5,0))","v":""},null,null,null,null,null,{"$f":"IF(E397=\"\",\"\",VLOOKUP(E397,Treinamentos!$B$13:$G$42,6,0))","v":""}]
[null,null,{"$f":"IF(B398=\"\",\"\",VLOOKUP(B398,Colab!$C$14:$E$63,2,0))","v":""},{"$f":"IF(B398=\"\",\"\",VLOOKUP(B398,Colab!$C$14:$E$63,3,0))","v":""},null,{"$f":"IF(E398=\"\",\"\",VLOOKUP(E398,Treinamentos!$B$13:$G$42,5,0))","v":""},null,null,null,null,null,{"$f":"IF(E398=\"\",\"\",VLOOKUP(E398,Treinamentos!$B$13:$G$42,6,0))","v":""}]
[null,null,{"$f":"IF(B399=\"\",\"\",VLOOKUP(B399,Colab!$C$14:$E$63,2,0))","v":""},{"$f":"IF(B399=\"\",\"\",VLOOKUP(B399,Colab!$C$14:$E$63,3,0))","v":""},null,{"$f":"IF(E399=\"\",\"\",VLOOKUP(E399,Treinamentos!$B$13:$G$42,5,0))","v":""},null,null,null,null,null,{"$f":"IF(E399=\"\",\"\",VLOOKUP(E399,Treinamentos!$B$13:$G$42,6,0))","v":""}]
[null,null,{"$f":"IF(B400=\"\",\"\",VLOOKUP(B400,Colab!$C$14:$E$63,2,0))","v":""},{"$f":"IF(B400=\"\",\"\",VLOOKUP(B400,Colab!$C$14:$E$63,3,0))","v":""},null,{"$f":"IF(E400=\"\",\"\",VLOOKUP(E400,Treinamentos!$B$13:$G$42,5,0))","v":""},null,null,null,null,null,{"$f":"IF(E400=\"\",\"\",VLOOKUP(E400,Treinamentos!$B$13:$G$42,6,0))","v":""}]
[null,null,{"$f":"IF(B401=\"\",\"\",VLOOKUP(B401,Colab!$C$14:$E$63,2,0))","v":""},{"$f":"IF(B401=\"\",\"\",VLOOKUP(B401,Colab!$C$14:$E$63,3,0))","v":""},null,{"$f":"IF(E401=\"\",\"\",VLOOKUP(E401,Treinamentos!$B$13:$G$42,5,0))","v":""},null,null,null,null,null,{"$f":"IF(E401=\"\",\"\",VLOOKUP(E401,Treinamentos!$B$13:$G$42,6,0))","v":""}]
[null,null,{"$f":"IF(B402=\"\",\"\",VLOOKUP(B402,Colab!$C$14:$E$63,2,0))","v":""},{"$f":"IF(B402=\"\",\"\",VLOOKUP(B402,Colab!$C$14:$E$63,3,0))","v":""},null,{"$f":"IF(E402=\"\",\"\",VLOOKUP(E402,Treinamentos!$B$13:$G$42,5,0))","v":""},null,null,null,null,null,{"$f":"IF(E402=\"\",\"\",VLOOKUP(E402,Treinamentos!$B$13:$G$42,6,0))","v":""}]
[null,null,{"$f":"IF(B403=\"\",\"\",VLOOKUP(B403,Colab!$C$14:$E$63,2,0))","v":""},{"$f":"IF(B403=\"\",\"\",VLOOKUP(B403,Colab!$C$14:$E$63,3,0))","v":""},null,{"$f":"IF(E403=\"\",\"\",VLOOKUP(E403,Treinamentos!$B$13:$G$42,5,0))","v":""},null,null,null,null,null,{"$f":"IF(E403=\"\",\"\",VLOOKUP(E403,Treinamentos!$B$13:$G$42,6,0))","v":""}]
[null,null,{"$f":"IF(B404=\"\",\"\",VLOOKUP(B404,Colab!$C$14:$E$63,2,0))","v":""},{"$f":"IF(B404=\"\",\"\",VLOOKUP(B404,Colab!$C$14:$E$63,3,0))","v":""},null,{"$f":"IF(E404=\"\",\"\",VLOOKUP(E404,Treinamentos!$B$13:$G$42,5,0))","v":""},null,null,null,null,null,{"$f":"IF(E404=\"\",\"\",VLOOKUP(E404,Treinamentos!$B$13:$G$42,6,0))","v":""}]
[null,null,{"$f":"IF(B405=\"\",\"\",VLOOKUP(B405,Colab!$C$14:$E$63,2,0))","v":""},{"$f":"IF(B405=\"\",\"\",VLOOKUP(B405,Colab!$C$14:$E$63,3,0))","v":""},null,{"$f":"IF(E405=\"\",\"\",VLOOKUP(E405,Treinamentos!$B$13:$G$42,5,0))","v":""},null,null,null,null,null,{"$f":"IF(E405=\"\",\"\",VLOOKUP(E405,Treinamentos!$B$13:$G$42,6,0))","v":""}]
[null,null,{"$f":"IF(B406=\"\",\"\",VLOOKUP(B406,Colab!$C$14:$E$63,2,0))","v":""},{"$f":"IF(B406=\"\",\"\",VLOOKUP(B406,Colab!$C$14:$E$63,3,0))","v":""},null,{"$f":"IF(E406=\"\",\"\",VLOOKUP(E406,Treinamentos!$B$13:$G$42,5,0))","v":""},null,null,null,null,null,{"$f":"IF(E406=\"\",\"\",VLOOKUP(E406,Treinamentos!$B$13:$G$42,6,0))","v":""}]
[null,null,{"$f":"IF(B407=\"\",\"\",VLOOKUP(B407,Colab!$C$14:$E$63,2,0))","v":""},{"$f":"IF(B407=\"\",\"\",VLOOKUP(B407,Colab!$C$14:$E$63,3,0))","v":""},null,{"$f":"IF(E407=\"\",\"\",VLOOKUP(E407,Treinamentos!$B$13:$G$42,5,0))","v":""},null,null,null,null,null,{"$f":"IF(E407=\"\",\"\",VLOOKUP(E407,Treinamentos!$B$13:$G$42,6,0))","v":""}]
[null,null,{"$f":"IF(B408=\"\",\"\",VLOOKUP(B408,Colab!$C$14:$E$63,2,0))","v":""},{"$f":"IF(B408=\"\",\"\",VLOOKUP(B408,Colab!$C$14:$E$63,3,0))","v":""},null,{"$f":"IF(E408=\"\",\"\",VLOOKUP(E408,Treinamentos!$B$13:$G$42,5,0))","v":""},null,null,null,null,null,{"$f":"IF(E408=\"\",\"\",VLOOKUP(E408,Treinamentos!$B$13:$G$42,6,0))","v":""}]
[null,null,{"$f":"IF(B409=\"\",\"\",VLOOKUP(B409,Colab!$C$14:$E$63,2,0))","v":""},{"$f":"IF(B409=\"\",\"\",VLOOKUP(B409,Colab!$C$14:$E$63,3,0))","v":""},null,{"$f":"IF(E409=\"\",\"\",VLOOKUP(E409,Treinamentos!$B$13:$G$42,5,0))","v":""},null,null,null,null,null,{"$f":"IF(E409=\"\",\"\",VLOOKUP(E409,Treinamentos!$B$13:$G$42,6,0))","v":""}]
[null,null,{"$f":"IF(B410=\"\",\"\",VLOOKUP(B410,Colab!$C$14:$E$63,2,0))","v":""},{"$f":"IF(B410=\"\",\"\",VLOOKUP(B410,Colab!$C$14:$E$63,3,0))","v":""},null,{"$f":"IF(E410=\"\",\"\",VLOOKUP(E410,Treinamentos!$B$13:$G$42,5,0))","v":""},null,null,null,null,null,{"$f":"IF(E410=\"\",\"\",VLOOKUP(E410,Treinamentos!$B$13:$G$42,6,0))","v":""}]
[null,null,{"$f":"IF(B411=\"\",\"\",VLOOKUP(B411,Colab!$C$14:$E$63,2,0))","v":""},{"$f":"IF(B411=\"\",\"\",VLOOKUP(B411,Colab!$C$14:$E$63,3,0))","v":""},null,{"$f":"IF(E411=\"\",\"\",VLOOKUP(E411,Treinamentos!$B$13:$G$42,5,0))","v":""},null,null,null,null,null,{"$f":"IF(E411=\"\",\"\",VLOOKUP(E411,Treinamentos!$B$13:$G$42,6,0))","v":""}]
[null,null,{"$f":"IF(B412=\"\",\"\",VLOOKUP(B412,Colab!$C$14:$E$63,2,0))","v":""},{"$f":"IF(B412=\"\",\"\",VLOOKUP(B412,Colab!$C$14:$E$63,3,0))","v":""},null,{"$f":"IF(E412=\"\",\"\",VLOOKUP(E412,Treinamentos!$B$13:$G$42,5,0))","v":""},null,null,null,null,null,{"$f":"IF(E412=\"\",\"\",VLOOKUP(E412,Treinamentos!$B$13:$G$42,6,0))","v":""}]
[null,null,{"$f":"IF(B413=\"\",\"\",VLOOKUP(B413,Colab!$C$14:$E$63,2,0))","v":""},{"$f":"IF(B413=\"\",\"\",VLOOKUP(B413,Colab!$C$14:$E$63,3,0))","v":""},null,{"$f":"IF(E413=\"\",\"\",VLOOKUP(E413,Treinamentos!$B$13:$G$42,5,0))","v":""},null,null,null,null,null,{"$f":"IF(E413=\"\",\"\",VLOOKUP(E413,Treinamentos!$B$13:$G$42,6,0))","v":""}]
[null,null,{"$f":"IF(B414=\"\",\"\",VLOOKUP(B414,Colab!$C$14:$E$63,2,0))","v":""},{"$f":"IF(B414=\"\",\"\",VLOOKUP(B414,Colab!$C$14:$E$63,3,0))","v":""},null,{"$f":"IF(E414=\"\",\"\",VLOOKUP(E414,Treinamentos!$B$13:$G$42,5,0))","v":""},null,null,null,null,null,{"$f":"IF(E414=\"\",\"\",VLOOKUP(E414,Treinamentos!$B$13:$G$42,6,0))","v":""}]
[null,null,{"$f":"IF(B415=\"\",\"\",VLOOKUP(B415,Colab!$C$14:$E$63,2,0))","v":""},{"$f":"IF(B415=\"\",\"\",VLOOKUP(B415,Colab!$C$14:$E$63,3,0))","v":""},null,{"$f":"IF(E415=\"\",\"\",VLOOKUP(E415,Treinamentos!$B$13:$G$42,5,0))","v":""},null,null,null,null,null,{"$f":"IF(E415=\"\",\"\",VLOOKUP(E415,Treinamentos!$B$13:$G$42,6,0))","v":""}]
[null,null,{"$f":"IF(B416=\"\",\"\",VLOOKUP(B416,Colab!$C$14:$E$63,2,0))","v":""},{"$f":"IF(B416=\"\",\"\",VLOOKUP(B416,Colab!$C$14:$E$63,3,0))","v":""},null,{"$f":"IF(E416=\"\",\"\",VLOOKUP(E416,Treinamentos!$B$13:$G$42,5,0))","v":""},null,null,null,null,null,{"$f":"IF(E416=\"\",\"\",VLOOKUP(E416,Treinamentos!$B$13:$G$42,6,0))","v":""}]
[null,null,{"$f":"IF(B417=\"\",\"\",VLOOKUP(B417,Colab!$C$14:$E$63,2,0))","v":""},{"$f":"IF(B417=\"\",\"\",VLOOKUP(B417,Colab!$C$14:$E$63,3,0))","v":""},null,{"$f":"IF(E417=\"\",\"\",VLOOKUP(E417,Treinamentos!$B$13:$G$42,5,0))","v":""},null,null,null,null,null,{"$f":"IF(E417=\"\",\"\",VLOOKUP(E417,Treinamentos!$B$13:$G$42,6,0))","v":""}]
[null,null,{"$f":"IF(B418=\"\",\"\",VLOOKUP(B418,Colab!$C$14:$E$63,2,0))","v":""},{"$f":"IF(B418=\"\",\"\",VLOOKUP(B418,Colab!$C$14:$E$63,3,0))","v":""},null,{"$f":"IF(E418=\"\",\"\",VLOOKUP(E418,Treinamentos!$B$13:$G$42,5,0))","v":""},null,null,null,null,null,{"$f":"IF(E418=\"\",\"\",VLOOKUP(E418,Treinamentos!$B$13:$G$42,6,0))","v":""}]
[null,null,{"$f":"IF(B419=\"\",\"\",VLOOKUP(B419,Colab!$C$14:$E$63,2,0))","v":""},{"$f":"IF(B419=\"\",\"\",VLOOKUP(B419,Colab!$C$14:$E$63,3,0))","v":""},null,{"$f":"IF(E419=\"\",\"\",VLOOKUP(E419,Treinamentos!$B$13:$G$42,5,0))","v":""},null,null,null,null,null,{"$f":"IF(E419=\"\",\"\",VLOOKUP(E419,Treinamentos!$B$13:$G$42,6,0))","v":""}]
[null,null,{"$f":"IF(B420=\"\",\"\",VLOOKUP(B420,Colab!$C$14:$E$63,2,0))","v":""},{"$f":"IF(B420=\"\",\"\",VLOOKUP(B420,Colab!$C$14:$E$63,3,0))","v":""},null,{"$f":"IF(E420=\"\",\"\",VLOOKUP(E420,Treinamentos!$B$13:$G$42,5,0))","v":""},null,null,null,null,null,{"$f":"IF(E420=\"\",\"\",VLOOKUP(E420,Treinamentos!$B$13:$G$42,6,0))","v":""}]
[null,null,{"$f":"IF(B421=\"\",\"\",VLOOKUP(B421,Colab!$C$14:$E$63,2,0))","v":""},{"$f":"IF(B421=\"\",\"\",VLOOKUP(B421,Colab!$C$14:$E$63,3,0))","v":""},null,{"$f":"IF(E421=\"\",\"\",VLOOKUP(E421,Treinamentos!$B$13:$G$42,5,0))","v":""},null,null,null,null,null,{"$f":"IF(E421=\"\",\"\",VLOOKUP(E421,Treinamentos!$B$13:$G$42,6,0))","v":""}]
[null,null,{"$f":"IF(B422=\"\",\"\",VLOOKUP(B422,Colab!$C$14:$E$63,2,0))","v":""},{"$f":"IF(B422=\"\",\"\",VLOOKUP(B422,Colab!$C$14:$E$63,3,0))","v":""},null,{"$f":"IF(E422=\"\",\"\",VLOOKUP(E422,Treinamentos!$B$13:$G$42,5,0))","v":""},null,null,null,null,null,{"$f":"IF(E422=\"\",\"\",VLOOKUP(E422,Treinamentos!$B$13:$G$42,6,0))","v":""}]
[null,null,{"$f":"IF(B423=\"\",\"\",VLOOKUP(B423,Colab!$C$14:$E$63,2,0))","v":""},{"$f":"IF(B423=\"\",\"\",VLOOKUP(B423,Colab!$C$14:$E$63,3,0))","v":""},null,{"$f":"IF(E423=\"\",\"\",VLOOKUP(E423,Treinamentos!$B$13:$G$42,5,0))","v":""},null,null,null,null,null,{"$f":"IF(E423=\"\",\"\",VLOOKUP(E423,Treinamentos!$B$13:$G$42,6,0))","v":""}]
[null,null,{"$f":"IF(B424=\"\",\"\",VLOOKUP(B424,Colab!$C$14:$E$63,2,0))","v":""},{"$f":"IF(B424=\"\",\"\",VLOOKUP(B424,Colab!$C$14:$E$63,3,0))","v":""},null,{"$f":"IF(E424=\"\",\"\",VLOOKUP(E424,Treinamentos!$B$13:$G$42,5,0))","v":""},null,null,null,null,null,{"$f":"IF(E424=\"\",\"\",VLOOKUP(E424,Treinamentos!$B$13:$G$42,6,0))","v":""}]
[null,null,{"$f":"IF(B425=\"\",\"\",VLOOKUP(B425,Colab!$C$14:$E$63,2,0))","v":""},{"$f":"IF(B425=\"\",\"\",VLOOKUP(B425,Colab!$C$14:$E$63,3,0))","v":""},null,{"$f":"IF(E425=\"\",\"\",VLOOKUP(E425,Treinamentos!$B$13:$G$42,5,0))","v":""},null,null,null,null,null,{"$f":"IF(E425=\"\",\"\",VLOOKUP(E425,Treinamentos!$B$13:$G$42,6,0))","v":""}]
[null,null,{"$f":"IF(B426=\"\",\"\",VLOOKUP(B426,Colab!$C$14:$E$63,2,0))","v":""},{"$f":"IF(B426=\"\",\"\",VLOOKUP(B426,Colab!$C$14:$E$63,3,0))","v":""},null,{"$f":"IF(E426=\"\",\"\",VLOOKUP(E426,Treinamentos!$B$13:$G$42,5,0))","v":""},null,null,null,null,null,{"$f":"IF(E426=\"\",\"\",VLOOKUP(E426,Treinamentos!$B$13:$G$42,6,0))","v":""}]
[null,null,{"$f":"IF(B427=\"\",\"\",VLOOKUP(B427,Colab!$C$14:$E$63,2,0))","v":""},{"$f":"IF(B427=\"\",\"\",VLOOKUP(B427,Colab!$C$14:$E$63,3,0))","v":""},null,{"$f":"IF(E427=\"\",\"\",VLOOKUP(E427,Treinamentos!$B$13:$G$42,5,0))","v":""},null,null,null,null,null,{"$f":"IF(E427=\"\",\"\",VLOOKUP(E427,Treinamentos!$B$13:$G$42,6,0))","v":""}]
[null,null,{"$f":"IF(B428=\"\",\"\",VLOOKUP(B428,Colab!$C$14:$E$63,2,0))","v":""},{"$f":"IF(B428=\"\",\"\",VLOOKUP(B428,Colab!$C$14:$E$63,3,0))","v":""},null,{"$f":"IF(E428=\"\",\"\",VLOOKUP(E428,Treinamentos!$B$13:$G$42,5,0))","v":""},null,null,null,null,null,{"$f":"IF(E428=\"\",\"\",VLOOKUP(E428,Treinamentos!$B$13:$G$42,6,0))","v":""}]
[null,null,{"$f":"IF(B429=\"\",\"\",VLOOKUP(B429,Colab!$C$14:$E$63,2,0))","v":""},{"$f":"IF(B429=\"\",\"\",VLOOKUP(B429,Colab!$C$14:$E$63,3,0))","v":""},null,{"$f":"IF(E429=\"\",\"\",VLOOKUP(E429,Treinamentos!$B$13:$G$42,5,0))","v":""},null,null,null,null,null,{"$f":"IF(E429=\"\",\"\",VLOOKUP(E429,Treinamentos!$B$13:$G$42,6,0))","v":""}]
[null,null,{"$f":"IF(B430=\"\",\"\",VLOOKUP(B430,Colab!$C$14:$E$63,2,0))","v":""},{"$f":"IF(B430=\"\",\"\",VLOOKUP(B430,Colab!$C$14:$E$63,3,0))","v":""},null,{"$f":"IF(E430=\"\",\"\",VLOOKUP(E430,Treinamentos!$B$13:$G$42,5,0))","v":""},null,null,null,null,null,{"$f":"IF(E430=\"\",\"\",VLOOKUP(E430,Treinamentos!$B$13:$G$42,6,0))","v":""}]
[null,null,{"$f":"IF(B431=\"\",\"\",VLOOKUP(B431,Colab!$C$14:$E$63,2,0))","v":""},{"$f":"IF(B431=\"\",\"\",VLOOKUP(B431,Colab!$C$14:$E$63,3,0))","v":""},null,{"$f":"IF(E431=\"\",\"\",VLOOKUP(E431,Treinamentos!$B$13:$G$42,5,0))","v":""},null,null,null,null,null,{"$f":"IF(E431=\"\",\"\",VLOOKUP(E431,Treinamentos!$B$13:$G$42,6,0))","v":""}]
[null,null,{"$f":"IF(B432=\"\",\"\",VLOOKUP(B432,Colab!$C$14:$E$63,2,0))","v":""},{"$f":"IF(B432=\"\",\"\",VLOOKUP(B432,Colab!$C$14:$E$63,3,0))","v":""},null,{"$f":"IF(E432=\"\",\"\",VLOOKUP(E432,Treinamentos!$B$13:$G$42,5,0))","v":""},null,null,null,null,null,{"$f":"IF(E432=\"\",\"\",VLOOKUP(E432,Treinamentos!$B$13:$G$42,6,0))","v":""}]
[null,null,{"$f":"IF(B433=\"\",\"\",VLOOKUP(B433,Colab!$C$14:$E$63,2,0))","v":""},{"$f":"IF(B433=\"\",\"\",VLOOKUP(B433,Colab!$C$14:$E$63,3,0))","v":""},null,{"$f":"IF(E433=\"\",\"\",VLOOKUP(E433,Treinamentos!$B$13:$G$42,5,0))","v":""},null,null,null,null,null,{"$f":"IF(E433=\"\",\"\",VLOOKUP(E433,Treinamentos!$B$13:$G$42,6,0))","v":""}]
[null,null,{"$f":"IF(B434=\"\",\"\",VLOOKUP(B434,Colab!$C$14:$E$63,2,0))","v":""},{"$f":"IF(B434=\"\",\"\",VLOOKUP(B434,Colab!$C$14:$E$63,3,0))","v":""},null,{"$f":"IF(E434=\"\",\"\",VLOOKUP(E434,Treinamentos!$B$13:$G$42,5,0))","v":""},null,null,null,null,null,{"$f":"IF(E434=\"\",\"\",VLOOKUP(E434,Treinamentos!$B$13:$G$42,6,0))","v":""}]
[null,null,{"$f":"IF(B435=\"\",\"\",VLOOKUP(B435,Colab!$C$14:$E$63,2,0))","v":""},{"$f":"IF(B435=\"\",\"\",VLOOKUP(B435,Colab!$C$14:$E$63,3,0))","v":""},null,{"$f":"IF(E435=\"\",\"\",VLOOKUP(E435,Treinamentos!$B$13:$G$42,5,0))","v":""},null,null,null,null,null,{"$f":"IF(E435=\"\",\"\",VLOOKUP(E435,Treinamentos!$B$13:$G$42,6,0))","v":""}]
[null,null,{"$f":"IF(B436=\"\",\"\",VLOOKUP(B436,Colab!$C$14:$E$63,2,0))","v":""},{"$f":"IF(B436=\"\",\"\",VLOOKUP(B436,Colab!$C$14:$E$63,3,0))","v":""},null,{"$f":"IF(E436=\"\",\"\",VLOOKUP(E436,Treinamentos!$B$13:$G$42,5,0))","v":""},null,null,null,null,null,{"$f":"IF(E436=\"\",\"\",VLOOKUP(E436,Treinamentos!$B$13:$G$42,6,0))","v":""}]
[null,null,{"$f":"IF(B437=\"\",\"\",VLOOKUP(B437,Colab!$C$14:$E$63,2,0))","v":""},{"$f":"IF(B437=\"\",\"\",VLOOKUP(B437,Colab!$C$14:$E$63,3,0))","v":""},null,{"$f":"IF(E437=\"\",\"\",VLOOKUP(E437,Treinamentos!$B$13:$G$42,5,0))","v":""},null,null,null,null,null,{"$f":"IF(E437=\"\",\"\",VLOOKUP(E437,Treinamentos!$B$13:$G$42,6,0))","v":""}]
[null,null,{"$f":"IF(B438=\"\",\"\",VLOOKUP(B438,Colab!$C$14:$E$63,2,0))","v":""},{"$f":"IF(B438=\"\",\"\",VLOOKUP(B438,Colab!$C$14:$E$63,3,0))","v":""},null,{"$f":"IF(E438=\"\",\"\",VLOOKUP(E438,Treinamentos!$B$13:$G$42,5,0))","v":""},null,null,null,null,null,{"$f":"IF(E438=\"\",\"\",VLOOKUP(E438,Treinamentos!$B$13:$G$42,6,0))","v":""}]
[null,null,{"$f":"IF(B439=\"\",\"\",VLOOKUP(B439,Colab!$C$14:$E$63,2,0))","v":""},{"$f":"IF(B439=\"\",\"\",VLOOKUP(B439,Colab!$C$14:$E$63,3,0))","v":""},null,{"$f":"IF(E439=\"\",\"\",VLOOKUP(E439,Treinamentos!$B$13:$G$42,5,0))","v":""},null,null,null,null,null,{"$f":"IF(E439=\"\",\"\",VLOOKUP(E439,Treinamentos!$B$13:$G$42,6,0))","v":""}]
[null,null,{"$f":"IF(B440=\"\",\"\",VLOOKUP(B440,Colab!$C$14:$E$63,2,0))","v":""},{"$f":"IF(B440=\"\",\"\",VLOOKUP(B440,Colab!$C$14:$E$63,3,0))","v":""},null,{"$f":"IF(E440=\"\",\"\",VLOOKUP(E440,Treinamentos!$B$13:$G$42,5,0))","v":""},null,null,null,null,null,{"$f":"IF(E440=\"\",\"\",VLOOKUP(E440,Treinamentos!$B$13:$G$42,6,0))","v":""}]
[null,null,{"$f":"IF(B441=\"\",\"\",VLOOKUP(B441,Colab!$C$14:$E$63,2,0))","v":""},{"$f":"IF(B441=\"\",\"\",VLOOKUP(B441,Colab!$C$14:$E$63,3,0))","v":""},null,{"$f":"IF(E441=\"\",\"\",VLOOKUP(E441,Treinamentos!$B$13:$G$42,5,0))","v":""},null,null,null,null,null,{"$f":"IF(E441=\"\",\"\",VLOOKUP(E441,Treinamentos!$B$13:$G$42,6,0))","v":""}]
[null,null,{"$f":"IF(B442=\"\",\"\",VLOOKUP(B442,Colab!$C$14:$E$63,2,0))","v":""},{"$f":"IF(B442=\"\",\"\",VLOOKUP(B442,Colab!$C$14:$E$63,3,0))","v":""},null,{"$f":"IF(E442=\"\",\"\",VLOOKUP(E442,Treinamentos!$B$13:$G$42,5,0))","v":""},null,null,null,null,null,{"$f":"IF(E442=\"\",\"\",VLOOKUP(E442,Treinamentos!$B$13:$G$42,6,0))","v":""}]
[null,null,{"$f":"IF(B443=\"\",\"\",VLOOKUP(B443,Colab!$C$14:$E$63,2,0))","v":""},{"$f":"IF(B443=\"\",\"\",VLOOKUP(B443,Colab!$C$14:$E$63,3,0))","v":""},null,{"$f":"IF(E443=\"\",\"\",VLOOKUP(E443,Treinamentos!$B$13:$G$42,5,0))","v":""},null,null,null,null,null,{"$f":"IF(E443=\"\",\"\",VLOOKUP(E443,Treinamentos!$B$13:$G$42,6,0))","v":""}]
[null,null,{"$f":"IF(B444=\"\",\"\",VLOOKUP(B444,Colab!$C$14:$E$63,2,0))","v":""},{"$f":"IF(B444=\"\",\"\",VLOOKUP(B444,Colab!$C$14:$E$63,3,0))","v":""},null,{"$f":"IF(E444=\"\",\"\",VLOOKUP(E444,Treinamentos!$B$13:$G$42,5,0))","v":""},null,null,null,null,null,{"$f":"IF(E444=\"\",\"\",VLOOKUP(E444,Treinamentos!$B$13:$G$42,6,0))","v":""}]
[null,null,{"$f":"IF(B445=\"\",\"\",VLOOKUP(B445,Colab!$C$14:$E$63,2,0))","v":""},{"$f":"IF(B445=\"\",\"\",VLOOKUP(B445,Colab!$C$14:$E$63,3,0))","v":""},null,{"$f":"IF(E445=\"\",\"\",VLOOKUP(E445,Treinamentos!$B$13:$G$42,5,0))","v":""},null,null,null,null,null,{"$f":"IF(E445=\"\",\"\",VLOOKUP(E445,Treinamentos!$B$13:$G$42,6,0))","v":""}]
[null,null,{"$f":"IF(B446=\"\",\"\",VLOOKUP(B446,Colab!$C$14:$E$63,2,0))","v":""},{"$f":"IF(B446=\"\",\"\",VLOOKUP(B446,Colab!$C$14:$E$63,3,0))","v":""},null,{"$f":"IF(E446=\"\",\"\",VLOOKUP(E446,Treinamentos!$B$13:$G$42,5,0))","v":""},null,null,null,null,null,{"$f":"IF(E446=\"\",\"\",VLOOKUP(E446,Treinamentos!$B$13:$G$42,6,0))","v":""}]
[null,null,{"$f":"IF(B447=\"\",\"\",VLOOKUP(B447,Colab!$C$14:$E$63,2,0))","v":""},{"$f":"IF(B447=\"\",\"\",VLOOKUP(B447,Colab!$C$14:$E$63,3,0))","v":""},null,{"$f":"IF(E447=\"\",\"\",VLOOKUP(E447,Treinamentos!$B$13:$G$42,5,0))","v":""},null,null,null,null,null,{"$f":"IF(E447=\"\",\"\",VLOOKUP(E447,Treinamentos!$B$13:$G$42,6,0))","v":""}]
[null,null,{"$f":"IF(B448=\"\",\"\",VLOOKUP(B448,Colab!$C$14:$E$63,2,0))","v":""},{"$f":"IF(B448=\"\",\"\",VLOOKUP(B448,Colab!$C$14:$E$63,3,0))","v":""},null,{"$f":"IF(E448=\"\",\"\",VLOOKUP(E448,Treinamentos!$B$13:$G$42,5,0))","v":""},null,null,null,null,null,{"$f":"IF(E448=\"\",\"\",VLOOKUP(E448,Treinamentos!$B$13:$G$42,6,0))","v":""}]
[null,null,{"$f":"IF(B449=\"\",\"\",VLOOKUP(B449,Colab!$C$14:$E$63,2,0))","v":""},{"$f":"IF(B449=\"\",\"\",VLOOKUP(B449,Colab!$C$14:$E$63,3,0))","v":""},null,{"$f":"IF(E449=\"\",\"\",VLOOKUP(E449,Treinamentos!$B$13:$G$42,5,0))","v":""},null,null,null,null,null,{"$f":"IF(E449=\"\",\"\",VLOOKUP(E449,Treinamentos!$B$13:$G$42,6,0))","v":""}]
[null,null,{"$f":"IF(B450=\"\",\"\",VLOOKUP(B450,Colab!$C$14:$E$63,2,0))","v":""},{"$f":"IF(B450=\"\",\"\",VLOOKUP(B450,Colab!$C$14:$E$63,3,0))","v":""},null,{"$f":"IF(E450=\"\",\"\",VLOOKUP(E450,Treinamentos!$B$13:$G$42,5,0))","v":""},null,null,null,null,null,{"$f":"IF(E450=\"\",\"\",VLOOKUP(E450,Treinamentos!$B$13:$G$42,6,0))","v":""}]
[null,null,{"$f":"IF(B451=\"\",\"\",VLOOKUP(B451,Colab!$C$14:$E$63,2,0))","v":""},{"$f":"IF(B451=\"\",\"\",VLOOKUP(B451,Colab!$C$14:$E$63,3,0))","v":""},null,{"$f":"IF(E451=\"\",\"\",VLOOKUP(E451,Treinamentos!$B$13:$G$42,5,0))","v":""},null,null,null,null,null,{"$f":"IF(E451=\"\",\"\",VLOOKUP(E451,Treinamentos!$B$13:$G$42,6,0))","v":""}]
[null,null,{"$f":"IF(B452=\"\",\"\",VLOOKUP(B452,Colab!$C$14:$E$63,2,0))","v":""},{"$f":"IF(B452=\"\",\"\",VLOOKUP(B452,Colab!$C$14:$E$63,3,0))","v":""},null,{"$f":"IF(E452=\"\",\"\",VLOOKUP(E452,Treinamentos!$B$13:$G$42,5,0))","v":""},null,null,null,null,null,{"$f":"IF(E452=\"\",\"\",VLOOKUP(E452,Treinamentos!$B$13:$G$42,6,0))","v":""}]
[null,null,{"$f":"IF(B453=\"\",\"\",VLOOKUP(B453,Colab!$C$14:$E$63,2,0))","v":""},{"$f":"IF(B453=\"\",\"\",VLOOKUP(B453,Colab!$C$14:$E$63,3,0))","v":""},null,{"$f":"IF(E453=\"\",\"\",VLOOKUP(E453,Treinamentos!$B$13:$G$42,5,0))","v":""},null,null,null,null,null,{"$f":"IF(E453=\"\",\"\",VLOOKUP(E453,Treinamentos!$B$13:$G$42,6,0))","v":""}]
[null,null,{"$f":"IF(B454=\"\",\"\",VLOOKUP(B454,Colab!$C$14:$E$63,2,0))","v":""},{"$f":"IF(B454=\"\",\"\",VLOOKUP(B454,Colab!$C$14:$E$63,3,0))","v":""},null,{"$f":"IF(E454=\"\",\"\",VLOOKUP(E454,Treinamentos!$B$13:$G$42,5,0))","v":""},null,null,null,null,null,{"$f":"IF(E454=\"\",\"\",VLOOKUP(E454,Treinamentos!$B$13:$G$42,6,0))","v":""}]
[null,null,{"$f":"IF(B455=\"\",\"\",VLOOKUP(B455,Colab!$C$14:$E$63,2,0))","v":""},{"$f":"IF(B455=\"\",\"\",VLOOKUP(B455,Colab!$C$14:$E$63,3,0))","v":""},null,{"$f":"IF(E455=\"\",\"\",VLOOKUP(E455,Treinamentos!$B$13:$G$42,5,0))","v":""},null,null,null,null,null,{"$f":"IF(E455=\"\",\"\",VLOOKUP(E455,Treinamentos!$B$13:$G$42,6,0))","v":""}]
[null,null,{"$f":"IF(B456=\"\",\"\",VLOOKUP(B456,Colab!$C$14:$E$63,2,0))","v":""},{"$f":"IF(B456=\"\",\"\",VLOOKUP(B456,Colab!$C$14:$E$63,3,0))","v":""},null,{"$f":"IF(E456=\"\",\"\",VLOOKUP(E456,Treinamentos!$B$13:$G$42,5,0))","v":""},null,null,null,null,null,{"$f":"IF(E456=\"\",\"\",VLOOKUP(E456,Treinamentos!$B$13:$G$42,6,0))","v":""}]
[null,null,{"$f":"IF(B457=\"\",\"\",VLOOKUP(B457,Colab!$C$14:$E$63,2,0))","v":""},{"$f":"IF(B457=\"\",\"\",VLOOKUP(B457,Colab!$C$14:$E$63,3,0))","v":""},null,{"$f":"IF(E457=\"\",\"\",VLOOKUP(E457,Treinamentos!$B$13:$G$42,5,0))","v":""},null,null,null,null,null,{"$f":"IF(E457=\"\",\"\",VLOOKUP(E457,Treinamentos!$B$13:$G$42,6,0))","v":""}]
[null,null,{"$f":"IF(B458=\"\",\"\",VLOOKUP(B458,Colab!$C$14:$E$63,2,0))","v":""},{"$f":"IF(B458=\"\",\"\",VLOOKUP(B458,Colab!$C$14:$E$63,3,0))","v":""},null,{"$f":"IF(E458=\"\",\"\",VLOOKUP(E458,Treinamentos!$B$13:$G$42,5,0))","v":""},null,null,null,null,null,{"$f":"IF(E458=\"\",\"\",VLOOKUP(E458,Treinamentos!$B$13:$G$42,6,0))","v":""}]
[null,null,{"$f":"IF(B459=\"\",\"\",VLOOKUP(B459,Colab!$C$14:$E$63,2,0))","v":""},{"$f":"IF(B459=\"\",\"\",VLOOKUP(B459,Colab!$C$14:$E$63,3,0))","v":""},null,{"$f":"IF(E459=\"\",\"\",VLOOKUP(E459,Treinamentos!$B$13:$G$42,5,0))","v":""},null,null,null,null,null,{"$f":"IF(E459=\"\",\"\",VLOOKUP(E459,Treinamentos!$B$13:$G$42,6,0))","v":""}]
[null,null,{"$f":"IF(B460=\"\",\"\",VLOOKUP(B460,Colab!$C$14:$E$63,2,0))","v":""},{"$f":"IF(B460=\"\",\"\",VLOOKUP(B460,Colab!$C$14:$E$63,3,0))","v":""},null,{"$f":"IF(E460=\"\",\"\",VLOOKUP(E460,Treinamentos!$B$13:$G$42,5,0))","v":""},null,null,null,null,null,{"$f":"IF(E460=\"\",\"\",VLOOKUP(E460,Treinamentos!$B$13:$G$42,6,0))","v":""}]
[null,null,{"$f":"IF(B461=\"\",\"\",VLOOKUP(B461,Colab!$C$14:$E$63,2,0))","v":""},{"$f":"IF(B461=\"\",\"\",VLOOKUP(B461,Colab!$C$14:$E$63,3,0))","v":""},null,{"$f":"IF(E461=\"\",\"\",VLOOKUP(E461,Treinamentos!$B$13:$G$42,5,0))","v":""},null,null,null,null,null,{"$f":"IF(E461=\"\",\"\",VLOOKUP(E461,Treinamentos!$B$13:$G$42,6,0))","v":""}]
[null,null,{"$f":"IF(B462=\"\",\"\",VLOOKUP(B462,Colab!$C$14:$E$63,2,0))","v":""},{"$f":"IF(B462=\"\",\"\",VLOOKUP(B462,Colab!$C$14:$E$63,3,0))","v":""},null,{"$f":"IF(E462=\"\",\"\",VLOOKUP(E462,Treinamentos!$B$13:$G$42,5,0))","v":""},null,null,null,null,null,{"$f":"IF(E462=\"\",\"\",VLOOKUP(E462,Treinamentos!$B$13:$G$42,6,0))","v":""}]
[null,null,{"$f":"IF(B463=\"\",\"\",VLOOKUP(B463,Colab!$C$14:$E$63,2,0))","v":""},{"$f":"IF(B463=\"\",\"\",VLOOKUP(B463,Colab!$C$14:$E$63,3,0))","v":""},null,{"$f":"IF(E463=\"\",\"\",VLOOKUP(E463,Treinamentos!$B$13:$G$42,5,0))","v":""},null,null,null,null,null,{"$f":"IF(E463=\"\",\"\",VLOOKUP(E463,Treinamentos!$B$13:$G$42,6,0))","v":""}]
[null,null,{"$f":"IF(B464=\"\",\"\",VLOOKUP(B464,Colab!$C$14:$E$63,2,0))","v":""},{"$f":"IF(B464=\"\",\"\",VLOOKUP(B464,Colab!$C$14:$E$63,3,0))","v":""},null,{"$f":"IF(E464=\"\",\"\",VLOOKUP(E464,Treinamentos!$B$13:$G$42,5,0))","v":""},null,null,null,null,null,{"$f":"IF(E464=\"\",\"\",VLOOKUP(E464,Treinamentos!$B$13:$G$42,6,0))","v":""}]
[null,null,{"$f":"IF(B465=\"\",\"\",VLOOKUP(B465,Colab!$C$14:$E$63,2,0))","v":""},{"$f":"IF(B465=\"\",\"\",VLOOKUP(B465,Colab!$C$14:$E$63,3,0))","v":""},null,{"$f":"IF(E465=\"\",\"\",VLOOKUP(E465,Treinamentos!$B$13:$G$42,5,0))","v":""},null,null,null,null,null,{"$f":"IF(E465=\"\",\"\",VLOOKUP(E465,Treinamentos!$B$13:$G$42,6,0))","v":""}]
[null,null,{"$f":"IF(B466=\"\",\"\",VLOOKUP(B466,Colab!$C$14:$E$63,2,0))","v":""},{"$f":"IF(B466=\"\",\"\",VLOOKUP(B466,Colab!$C$14:$E$63,3,0))","v":""},null,{"$f":"IF(E466=\"\",\"\",VLOOKUP(E466,Treinamentos!$B$13:$G$42,5,0))","v":""},null,null,null,null,null,{"$f":"IF(E466=\"\",\"\",VLOOKUP(E466,Treinamentos!$B$13:$G$42,6,0))","v":""}]
[null,null,{"$f":"IF(B467=\"\",\"\",VLOOKUP(B467,Colab!$C$14:$E$63,2,0))","v":""},{"$f":"IF(B467=\"\",\"\",VLOOKUP(B467,Colab!$C$14:$E$63,3,0))","v":""},null,{"$f":"IF(E467=\"\",\"\",VLOOKUP(E467,Treinamentos!$B$13:$G$42,5,0))","v":""},null,null,null,null,null,{"$f":"IF(E467=\"\",\"\",VLOOKUP(E467,Treinamentos!$B$13:$G$42,6,0))","v":""}]
[null,null,{"$f":"IF(B468=\"\",\"\",VLOOKUP(B468,Colab!$C$14:$E$63,2,0))","v":""},{"$f":"IF(B468=\"\",\"\",VLOOKUP(B468,Colab!$C$14:$E$63,3,0))","v":""},null,{"$f":"IF(E468=\"\",\"\",VLOOKUP(E468,Treinamentos!$B$13:$G$42,5,0))","v":""},null,null,null,null,null,{"$f":"IF(E468=\"\",\"\",VLOOKUP(E468,Treinamentos!$B$13:$G$42,6,0))","v":""}]
[null,null,{"$f":"IF(B469=\"\",\"\",VLOOKUP(B469,Colab!$C$14:$E$63,2,0))","v":""},{"$f":"IF(B469=\"\",\"\",VLOOKUP(B469,Colab!$C$14:$E$63,3,0))","v":""},null,{"$f":"IF(E469=\"\",\"\",VLOOKUP(E469,Treinamentos!$B$13:$G$42,5,0))","v":""},null,null,null,null,null,{"$f":"IF(E469=\"\",\"\",VLOOKUP(E469,Treinamentos!$B$13:$G$42,6,0))","v":""}]
[null,null,{"$f":"IF(B470=\"\",\"\",VLOOKUP(B470,Colab!$C$14:$E$63,2,0))","v":""},{"$f":"IF(B470=\"\",\"\",VLOOKUP(B470,Colab!$C$14:$E$63,3,0))","v":""},null,{"$f":"IF(E470=\"\",\"\",VLOOKUP(E470,Treinamentos!$B$13:$G$42,5,0))","v":""},null,null,null,null,null,{"$f":"IF(E470=\"\",\"\",VLOOKUP(E470,Treinamentos!$B$13:$G$42,6,0))","v":""}]
[null,null,{"$f":"IF(B471=\"\",\"\",VLOOKUP(B471,Colab!$C$14:$E$63,2,0))","v":""},{"$f":"IF(B471=\"\",\"\",VLOOKUP(B471,Colab!$C$14:$E$63,3,0))","v":""},null,{"$f":"IF(E471=\"\",\"\",VLOOKUP(E471,Treinamentos!$B$13:$G$42,5,0))","v":""},null,null,null,null,null,{"$f":"IF(E471=\"\",\"\",VLOOKUP(E471,Treinamentos!$B$13:$G$42,6,0))","v":""}]
[null,null,{"$f":"IF(B472=\"\",\"\",VLOOKUP(B472,Colab!$C$14:$E$63,2,0))","v":""},{"$f":"IF(B472=\"\",\"\",VLOOKUP(B472,Colab!$C$14:$E$63,3,0))","v":""},null,{"$f":"IF(E472=\"\",\"\",VLOOKUP(E472,Treinamentos!$B$13:$G$42,5,0))","v":""},null,null,null,null,null,{"$f":"IF(E472=\"\",\"\",VLOOKUP(E472,Treinamentos!$B$13:$G$42,6,0))","v":""}]
[null,null,{"$f":"IF(B473=\"\",\"\",VLOOKUP(B473,Colab!$C$14:$E$63,2,0))","v":""},{"$f":"IF(B473=\"\",\"\",VLOOKUP(B473,Colab!$C$14:$E$63,3,0))","v":""},null,{"$f":"IF(E473=\"\",\"\",VLOOKUP(E473,Treinamentos!$B$13:$G$42,5,0))","v":""},null,null,null,null,null,{"$f":"IF(E473=\"\",\"\",VLOOKUP(E473,Treinamentos!$B$13:$G$42,6,0))","v":""}]
[null,null,{"$f":"IF(B474=\"\",\"\",VLOOKUP(B474,Colab!$C$14:$E$63,2,0))","v":""},{"$f":"IF(B474=\"\",\"\",VLOOKUP(B474,Colab!$C$14:$E$63,3,0))","v":""},null,{"$f":"IF(E474=\"\",\"\",VLOOKUP(E474,Treinamentos!$B$13:$G$42,5,0))","v":""},null,null,null,null,null,{"$f":"IF(E474=\"\",\"\",VLOOKUP(E474,Treinamentos!$B$13:$G$42,6,0))","v":""}]
[null,null,{"$f":"IF(B475=\"\",\"\",VLOOKUP(B475,Colab!$C$14:$E$63,2,0))","v":""},{"$f":"IF(B475=\"\",\"\",VLOOKUP(B475,Colab!$C$14:$E$63,3,0))","v":""},null,{"$f":"IF(E475=\"\",\"\",VLOOKUP(E475,Treinamentos!$B$13:$G$42,5,0))","v":""},null,null,null,null,null,{"$f":"IF(E475=\"\",\"\",VLOOKUP(E475,Treinamentos!$B$13:$G$42,6,0))","v":""}]
[null,null,{"$f":"IF(B476=\"\",\"\",VLOOKUP(B476,Colab!$C$14:$E$63,2,0))","v":""},{"$f":"IF(B476=\"\",\"\",VLOOKUP(B476,Colab!$C$14:$E$63,3,0))","v":""},null,{"$f":"IF(E476=\"\",\"\",VLOOKUP(E476,Treinamentos!$B$13:$G$42,5,0))","v":""},null,null,null,null,null,{"$f":"IF(E476=\"\",\"\",VLOOKUP(E476,Treinamentos!$B$13:$G$42,6,0))","v":""}]
[null,null,{"$f":"IF(B477=\"\",\"\",VLOOKUP(B477,Colab!$C$14:$E$63,2,0))","v":""},{"$f":"IF(B477=\"\",\"\",VLOOKUP(B477,Colab!$C$14:$E$63,3,0))","v":""},null,{"$f":"IF(E477=\"\",\"\",VLOOKUP(E477,Treinamentos!$B$13:$G$42,5,0))","v":""},null,null,null,null,null,{"$f":"IF(E477=\"\",\"\",VLOOKUP(E477,Treinamentos!$B$13:$G$42,6,0))","v":""}]
[null,null,{"$f":"IF(B478=\"\",\"\",VLOOKUP(B478,Colab!$C$14:$E$63,2,0))","v":""},{"$f":"IF(B478=\"\",\"\",VLOOKUP(B478,Colab!$C$14:$E$63,3,0))","v":""},null,{"$f":"IF(E478=\"\",\"\",VLOOKUP(E478,Treinamentos!$B$13:$G$42,5,0))","v":""},null,null,null,null,null,{"$f":"IF(E478=\"\",\"\",VLOOKUP(E478,Treinamentos!$B$13:$G$42,6,0))","v":""}]
[null,null,{"$f":"IF(B479=\"\",\"\",VLOOKUP(B479,Colab!$C$14:$E$63,2,0))","v":""},{"$f":"IF(B479=\"\",\"\",VLOOKUP(B479,Colab!$C$14:$E$63,3,0))","v":""},null,{"$f":"IF(E479=\"\",\"\",VLOOKUP(E479,Treinamentos!$B$13:$G$42,5,0))","v":""},null,null,null,null,null,{"$f":"IF(E479=\"\",\"\",VLOOKUP(E479,Treinamentos!$B$13:$G$42,6,0))","v":""}]
[null,null,{"$f":"IF(B480=\"\",\"\",VLOOKUP(B480,Colab!$C$14:$E$63,2,0))","v":""},{"$f":"IF(B480=\"\",\"\",VLOOKUP(B480,Colab!$C$14:$E$63,3,0))","v":""},null,{"$f":"IF(E480=\"\",\"\",VLOOKUP(E480,Treinamentos!$B$13:$G$42,5,0))","v":""},null,null,null,null,null,{"$f":"IF(E480=\"\",\"\",VLOOKUP(E480,Treinamentos!$B$13:$G$42,6,0))","v":""}]
[null,null,{"$f":"IF(B481=\"\",\"\",VLOOKUP(B481,Colab!$C$14:$E$63,2,0))","v":""},{"$f":"IF(B481=\"\",\"\",VLOOKUP(B481,Colab!$C$14:$E$63,3,0))","v":""},null,{"$f":"IF(E481=\"\",\"\",VLOOKUP(E481,Treinamentos!$B$13:$G$42,5,0))","v":""},null,null,null,null,null,{"$f":"IF(E481=\"\",\"\",VLOOKUP(E481,Treinamentos!$B$13:$G$42,6,0))","v":""}]
[null,null,{"$f":"IF(B482=\"\",\"\",VLOOKUP(B482,Colab!$C$14:$E$63,2,0))","v":""},{"$f":"IF(B482=\"\",\"\",VLOOKUP(B482,Colab!$C$14:$E$63,3,0))","v":""},null,{"$f":"IF(E482=\"\",\"\",VLOOKUP(E482,Treinamentos!$B$13:$G$42,5,0))","v":""},null,null,null,null,null,{"$f":"IF(E482=\"\",\"\",VLOOKUP(E482,Treinamentos!$B$13:$G$42,6,0))","v":""}]
[null,null,{"$f":"IF(B483=\"\",\"\",VLOOKUP(B483,Colab!$C$14:$E$63,2,0))","v":""},{"$f":"IF(B483=\"\",\"\",VLOOKUP(B483,Colab!$C$14:$E$63,3,0))","v":""},null,{"$f":"IF(E483=\"\",\"\",VLOOKUP(E483,Treinamentos!$B$13:$G$42,5,0))","v":""},null,null,null,null,null,{"$f":"IF(E483=\"\",\"\",VLOOKUP(E483,Treinamentos!$B$13:$G$42,6,0))","v":""}]
[null,null,{"$f":"IF(B484=\"\",\"\",VLOOKUP(B484,Colab!$C$14:$E$63,2,0))","v":""},{"$f":"IF(B484=\"\",\"\",VLOOKUP(B484,Colab!$C$14:$E$63,3,0))","v":""},null,{"$f":"IF(E484=\"\",\"\",VLOOKUP(E484,Treinamentos!$B$13:$G$42,5,0))","v":""},null,null,null,null,null,{"$f":"IF(E484=\"\",\"\",VLOOKUP(E484,Treinamentos!$B$13:$G$42,6,0))","v":""}]
[null,null,{"$f":"IF(B485=\"\",\"\",VLOOKUP(B485,Colab!$C$14:$E$63,2,0))","v":""},{"$f":"IF(B485=\"\",\"\",VLOOKUP(B485,Colab!$C$14:$E$63,3,0))","v":""},null,{"$f":"IF(E485=\"\",\"\",VLOOKUP(E485,Treinamentos!$B$13:$G$42,5,0))","v":""},null,null,null,null,null,{"$f":"IF(E485=\"\",\"\",VLOOKUP(E485,Treinamentos!$B$13:$G$42,6,0))","v":""}]
[null,null,{"$f":"IF(B486=\"\",\"\",VLOOKUP(B486,Colab!$C$14:$E$63,2,0))","v":""},{"$f":"IF(B486=\"\",\"\",VLOOKUP(B486,Colab!$C$14:$E$63,3,0))","v":""},null,{"$f":"IF(E486=\"\",\"\",VLOOKUP(E486,Treinamentos!$B$13:$G$42,5,0))","v":""},null,null,null,null,null,{"$f":"IF(E486=\"\",\"\",VLOOKUP(E486,Treinamentos!$B$13:$G$42,6,0))","v":""}]
[null,null,{"$f":"IF(B487=\"\",\"\",VLOOKUP(B487,Colab!$C$14:$E$63,2,0))","v":""},{"$f":"IF(B487=\"\",\"\",VLOOKUP(B487,Colab!$C$14:$E$63,3,0))","v":""},null,{"$f":"IF(E487=\"\",\"\",VLOOKUP(E487,Treinamentos!$B$13:$G$42,5,0))","v":""},null,null,null,null,null,{"$f":"IF(E487=\"\",\"\",VLOOKUP(E487,Treinamentos!$B$13:$G$42,6,0))","v":""}]
[null,null,{"$f":"IF(B488=\"\",\"\",VLOOKUP(B488,Colab!$C$14:$E$63,2,0))","v":""},{"$f":"IF(B488=\"\",\"\",VLOOKUP(B488,Colab!$C$14:$E$63,3,0))","v":""},null,{"$f":"IF(E488=\"\",\"\",VLOOKUP(E488,Treinamentos!$B$13:$G$42,5,0))","v":""},null,null,null,null,null,{"$f":"IF(E488=\"\",\"\",VLOOKUP(E488,Treinamentos!$B$13:$G$42,6,0))","v":""}]
[null,null,{"$f":"IF(B489=\"\",\"\",VLOOKUP(B489,Colab!$C$14:$E$63,2,0))","v":""},{"$f":"IF(B489=\"\",\"\",VLOOKUP(B489,Colab!$C$14:$E$63,3,0))","v":""},null,{"$f":"IF(E489=\"\",\"\",VLOOKUP(E489,Treinamentos!$B$13:$G$42,5,0))","v":""},null,null,null,null,null,{"$f":"IF(E489=\"\",\"\",VLOOKUP(E489,Treinamentos!$B$13:$G$42,6,0))","v":""}]
[null,null,{"$f":"IF(B490=\"\",\"\",VLOOKUP(B490,Colab!$C$14:$E$63,2,0))","v":""},{"$f":"IF(B490=\"\",\"\",VLOOKUP(B490,Colab!$C$14:$E$63,3,0))","v":""},null,{"$f":"IF(E490=\"\",\"\",VLOOKUP(E490,Treinamentos!$B$13:$G$42,5,0))","v":""},null,null,null,null,null,{"$f":"IF(E490=\"\",\"\",VLOOKUP(E490,Treinamentos!$B$13:$G$42,6,0))","v":""}]
[null,null,{"$f":"IF(B491=\"\",\"\",VLOOKUP(B491,Colab!$C$14:$E$63,2,0))","v":""},{"$f":"IF(B491=\"\",\"\",VLOOKUP(B491,Colab!$C$14:$E$63,3,0))","v":""},null,{"$f":"IF(E491=\"\",\"\",VLOOKUP(E491,Treinamentos!$B$13:$G$42,5,0))","v":""},null,null,null,null,null,{"$f":"IF(E491=\"\",\"\",VLOOKUP(E491,Treinamentos!$B$13:$G$42,6,0))","v":""}]
[null,null,{"$f":"IF(B492=\"\",\"\",VLOOKUP(B492,Colab!$C$14:$E$63,2,0))","v":""},{"$f":"IF(B492=\"\",\"\",VLOOKUP(B492,Colab!$C$14:$E$63,3,0))","v":""},null,{"$f":"IF(E492=\"\",\"\",VLOOKUP(E492,Treinamentos!$B$13:$G$42,5,0))","v":""},null,null,null,null,null,{"$f":"IF(E492=\"\",\"\",VLOOKUP(E492,Treinamentos!$B$13:$G$42,6,0))","v":""}]
[null,null,{"$f":"IF(B493=\"\",\"\",VLOOKUP(B493,Colab!$C$14:$E$63,2,0))","v":""},{"$f":"IF(B493=\"\",\"\",VLOOKUP(B493,Colab!$C$14:$E$63,3,0))","v":""},null,{"$f":"IF(E493=\"\",\"\",VLOOKUP(E493,Treinamentos!$B$13:$G$42,5,0))","v":""},null,null,null,null,null,{"$f":"IF(E493=\"\",\"\",VLOOKUP(E493,Treinamentos!$B$13:$G$42,6,0))","v":""}]
[null,null,{"$f":"IF(B494=\"\",\"\",VLOOKUP(B494,Colab!$C$14:$E$63,2,0))","v":""},{"$f":"IF(B494=\"\",\"\",VLOOKUP(B494,Colab!$C$14:$E$63,3,0))","v":""},null,{"$f":"IF(E494=\"\",\"\",VLOOKUP(E494,Treinamentos!$B$13:$G$42,5,0))","v":""},null,null,null,null,null,{"$f":"IF(E494=\"\",\"\",VLOOKUP(E494,Treinamentos!$B$13:$G$42,6,0))","v":""}]
[null,null,{"$f":"IF(B495=\"\",\"\",VLOOKUP(B495,Colab!$C$14:$E$63,2,0))","v":""},{"$f":"IF(B495=\"\",\"\",VLOOKUP(B495,Colab!$C$14:$E$63,3,0))","v":""},null,{"$f":"IF(E495=\"\",\"\",VLOOKUP(E495,Treinamentos!$B$13:$G$42,5,0))","v":""},null,null,null,null,null,{"$f":"IF(E495=\"\",\"\",VLOOKUP(E495,Treinamentos!$B$13:$G$42,6,0))","v":""}]
[null,null,{"$f":"IF(B496=\"\",\"\",VLOOKUP(B496,Colab!$C$14:$E$63,2,0))","v":""},{"$f":"IF(B496=\"\",\"\",VLOOKUP(B496,Colab!$C$14:$E$63,3,0))","v":""},null,{"$f":"IF(E496=\"\",\"\",VLOOKUP(E496,Treinamentos!$B$13:$G$42,5,0))","v":""},null,null,null,null,null,{"$f":"IF(E496=\"\",\"\",VLOOKUP(E496,Treinamentos!$B$13:$G$42,6,0))","v":""}]
[null,null,{"$f":"IF(B497=\"\",\"\",VLOOKUP(B497,Colab!$C$14:$E$63,2,0))","v":""},{"$f":"IF(B497=\"\",\"\",VLOOKUP(B497,Colab!$C$14:$E$63,3,0))","v":""},null,{"$f":"IF(E497=\"\",\"\",VLOOKUP(E497,Treinamentos!$B$13:$G$42,5,0))","v":""},null,null,null,null,null,{"$f":"IF(E497=\"\",\"\",VLOOKUP(E497,Treinamentos!$B$13:$G$42,6,0))","v":""}]
[null,null,{"$f":"IF(B498=\"\",\"\",VLOOKUP(B498,Colab!$C$14:$E$63,2,0))","v":""},{"$f":"IF(B498=\"\",\"\",VLOOKUP(B498,Colab!$C$14:$E$63,3,0))","v":""},null,{"$f":"IF(E498=\"\",\"\",VLOOKUP(E498,Treinamentos!$B$13:$G$42,5,0))","v":""},null,null,null,null,null,{"$f":"IF(E498=\"\",\"\",VLOOKUP(E498,Treinamentos!$B$13:$G$42,6,0))","v":""}]
[null,null,{"$f":"IF(B499=\"\",\"\",VLOOKUP(B499,Colab!$C$14:$E$63,2,0))","v":""},{"$f":"IF(B499=\"\",\"\",VLOOKUP(B499,Colab!$C$14:$E$63,3,0))","v":""},null,{"$f":"IF(E499=\"\",\"\",VLOOKUP(E499,Treinamentos!$B$13:$G$42,5,0))","v":""},null,null,null,null,null,{"$f":"IF(E499=\"\",\"\",VLOOKUP(E499,Treinamentos!$B$13:$G$42,6,0))","v":""}]
[null,null,{"$f":"IF(B500=\"\",\"\",VLOOKUP(B500,Colab!$C$14:$E$63,2,0))","v":""},{"$f":"IF(B500=\"\",\"\",VLOOKUP(B500,Colab!$C$14:$E$63,3,0))","v":""},null,{"$f":"IF(E500=\"\",\"\",VLOOKUP(E500,Treinamentos!$B$13:$G$42,5,0))","v":""},null,null,null,null,null,{"$f":"IF(E500=\"\",\"\",VLOOKUP(E500,Treinamentos!$B$13:$G$42,6,0))","v":""}]
[null,null,{"$f":"IF(B501=\"\",\"\",VLOOKUP(B501,Colab!$C$14:$E$63,2,0))","v":""},{"$f":"IF(B501=\"\",\"\",VLOOKUP(B501,Colab!$C$14:$E$63,3,0))","v":""},null,{"$f":"IF(E501=\"\",\"\",VLOOKUP(E501,Treinamentos!$B$13:$G$42,5,0))","v":""},null,null,null,null,null,{"$f":"IF(E501=\"\",\"\",VLOOKUP(E501,Treinamentos!$B$13:$G$42,6,0))","v":""}]
[null,null,{"$f":"IF(B502=\"\",\"\",VLOOKUP(B502,Colab!$C$14:$E$63,2,0))","v":""},{"$f":"IF(B502=\"\",\"\",VLOOKUP(B502,Colab!$C$14:$E$63,3,0))","v":""},null,{"$f":"IF(E502=\"\",\"\",VLOOKUP(E502,Treinamentos!$B$13:$G$42,5,0))","v":""},null,null,null,null,null,{"$f":"IF(E502=\"\",\"\",VLOOKUP(E502,Treinamentos!$B$13:$G$42,6,0))","v":""}]
[null,null,{"$f":"IF(B503=\"\",\"\",VLOOKUP(B503,Colab!$C$14:$E$63,2,0))","v":""},{"$f":"IF(B503=\"\",\"\",VLOOKUP(B503,Colab!$C$14:$E$63,3,0))","v":""},null,{"$f":"IF(E503=\"\",\"\",VLOOKUP(E503,Treinamentos!$B$13:$G$42,5,0))","v":""},null,null,null,null,null,{"$f":"IF(E503=\"\",\"\",VLOOKUP(E503,Treinamentos!$B$13:$G$42,6,0))","v":""}]
[null,null,{"$f":"IF(B504=\"\",\"\",VLOOKUP(B504,Colab!$C$14:$E$63,2,0))","v":""},{"$f":"IF(B504=\"\",\"\",VLOOKUP(B504,Colab!$C$14:$E$63,3,0))","v":""},null,{"$f":"IF(E504=\"\",\"\",VLOOKUP(E504,Treinamentos!$B$13:$G$42,5,0))","v":""},null,null,null,null,null,{"$f":"IF(E504=\"\",\"\",VLOOKUP(E504,Treinamentos!$B$13:$G$42,6,0))","v":""}]
[null,null,{"$f":"IF(B505=\"\",\"\",VLOOKUP(B505,Colab!$C$14:$E$63,2,0))","v":""},{"$f":"IF(B505=\"\",\"\",VLOOKUP(B505,Colab!$C$14:$E$63,3,0))","v":""},null,{"$f":"IF(E505=\"\",\"\",VLOOKUP(E505,Treinamentos!$B$13:$G$42,5,0))","v":""},null,null,null,null,null,{"$f":"IF(E505=\"\",\"\",VLOOKUP(E505,Treinamentos!$B$13:$G$42,6,0))","v":""}]
[null,null,{"$f":"IF(B506=\"\",\"\",VLOOKUP(B506,Colab!$C$14:$E$63,2,0))","v":""},{"$f":"IF(B506=\"\",\"\",VLOOKUP(B506,Colab!$C$14:$E$63,3,0))","v":""},null,{"$f":"IF(E506=\"\",\"\",VLOOKUP(E506,Treinamentos!$B$13:$G$42,5,0))","v":""},null,null,null,null,null,{"$f":"IF(E506=\"\",\"\",VLOOKUP(E506,Treinamentos!$B$13:$G$42,6,0))","v":""}]
[null,null,{"$f":"IF(B507=\"\",\"\",VLOOKUP(B507,Colab!$C$14:$E$63,2,0))","v":""},{"$f":"IF(B507=\"\",\"\",VLOOKUP(B507,Colab!$C$14:$E$63,3,0))","v":""},null,{"$f":"IF(E507=\"\",\"\",VLOOKUP(E507,Treinamentos!$B$13:$G$42,5,0))","v":""},null,null,null,null,null,{"$f":"IF(E507=\"\",\"\",VLOOKUP(E507,Treinamentos!$B$13:$G$42,6,0))","v":""}]
[null,null,{"$f":"IF(B508=\"\",\"\",VLOOKUP(B508,Colab!$C$14:$E$63,2,0))","v":""},{"$f":"IF(B508=\"\",\"\",VLOOKUP(B508,Colab!$C$14:$E$63,3,0))","v":""},null,{"$f":"IF(E508=\"\",\"\",VLOOKUP(E508,Treinamentos!$B$13:$G$42,5,0))","v":""},null,null,null,null,null,{"$f":"IF(E508=\"\",\"\",VLOOKUP(E508,Treinamentos!$B$13:$G$42,6,0))","v":""}]
[null,null,{"$f":"IF(B509=\"\",\"\",VLOOKUP(B509,Colab!$C$14:$E$63,2,0))","v":""},{"$f":"IF(B509=\"\",\"\",VLOOKUP(B509,Colab!$C$14:$E$63,3,0))","v":""},null,{"$f":"IF(E509=\"\",\"\",VLOOKUP(E509,Treinamentos!$B$13:$G$42,5,0))","v":""},null,null,null,null,null,{"$f":"IF(E509=\"\",\"\",VLOOKUP(E509,Treinamentos!$B$13:$G$42,6,0))","v":""}]
[null,null,{"$f":"IF(B510=\"\",\"\",VLOOKUP(B510,Colab!$C$14:$E$63,2,0))","v":""},{"$f":"IF(B510=\"\",\"\",VLOOKUP(B510,Colab!$C$14:$E$63,3,0))","v":""},null,{"$f":"IF(E510=\"\",\"\",VLOOKUP(E510,Treinamentos!$B$13:$G$42,5,0))","v":""},null,null,null,null,null,{"$f":"IF(E510=\"\",\"\",VLOOKUP(E510,Treinamentos!$B$13:$G$42,6,0))","v":""}]
[null,null,{"$f":"IF(B511=\"\",\"\",VLOOKUP(B511,Colab!$C$14:$E$63,2,0))","v":""},{"$f":"IF(B511=\"\",\"\",VLOOKUP(B511,Colab!$C$14:$E$63,3,0))","v":""},null,{"$f":"IF(E511=\"\",\"\",VLOOKUP(E511,Treinamentos!$B$13:$G$42,5,0))","v":""},null,null,null,null,null,{"$f":"IF(E511=\"\",\"\",VLOOKUP(E511,Treinamentos!$B$13:$G$42,6,0))","v":""}]
[null,null,{"$f":"IF(B512=\"\",\"\",VLOOKUP(B512,Colab!$C$14:$E$63,2,0))","v":""},{"$f":"IF(B512=\"\",\"\",VLOOKUP(B512,Colab!$C$14:$E$63,3,0))","v":""},null,{"$f":"IF(E512=\"\",\"\",VLOOKUP(E512,Treinamentos!$B$13:$G$42,5,0))","v":""},null,null,null,null,null,{"$f":"IF(E512=\"\",\"\",VLOOKUP(E512,Treinamentos!$B$13:$G$42,6,0))","v":""}]
[null,null,{"$f":"IF(B513=\"\",\"\",VLOOKUP(B513,Colab!$C$14:$E$63,2,0))","v":""},{"$f":"IF(B513=\"\",\"\",VLOOKUP(B513,Colab!$C$14:$E$63,3,0))","v":""},null,{"$f":"IF(E513=\"\",\"\",VLOOKUP(E513,Treinamentos!$B$13:$G$42,5,0))","v":""},null,null,null,null,null,{"$f":"IF(E513=\"\",\"\",VLOOKUP(E513,Treinamentos!$B$13:$G$42,6,0))","v":""}]
[null,null,{"$f":"IF(B514=\"\",\"\",VLOOKUP(B514,Colab!$C$14:$E$63,2,0))","v":""},{"$f":"IF(B514=\"\",\"\",VLOOKUP(B514,Colab!$C$14:$E$63,3,0))","v":""},null,{"$f":"IF(E514=\"\",\"\",VLOOKUP(E514,Treinamentos!$B$13:$G$42,5,0))","v":""},null,null,null,null,null,{"$f":"IF(E514=\"\",\"\",VLOOKUP(E514,Treinamentos!$B$13:$G$42,6,0))","v":""}]
[null,null,{"$f":"IF(B515=\"\",\"\",VLOOKUP(B515,Colab!$C$14:$E$63,2,0))","v":""},{"$f":"IF(B515=\"\",\"\",VLOOKUP(B515,Colab!$C$14:$E$63,3,0))","v":""},null,{"$f":"IF(E515=\"\",\"\",VLOOKUP(E515,Treinamentos!$B$13:$G$42,5,0))","v":""},null,null,null,null,null,{"$f":"IF(E515=\"\",\"\",VLOOKUP(E515,Treinamentos!$B$13:$G$42,6,0))","v":""}]
[null,null,{"$f":"IF(B516=\"\",\"\",VLOOKUP(B516,Colab!$C$14:$E$63,2,0))","v":""},{"$f":"IF(B516=\"\",\"\",VLOOKUP(B516,Colab!$C$14:$E$63,3,0))","v":""},null,{"$f":"IF(E516=\"\",\"\",VLOOKUP(E516,Treinamentos!$B$13:$G$42,5,0))","v":""},null,null,null,null,null,{"$f":"IF(E516=\"\",\"\",VLOOKUP(E516,Treinamentos!$B$13:$G$42,6,0))","v":""}]
[null,null,{"$f":"IF(B517=\"\",\"\",VLOOKUP(B517,Colab!$C$14:$E$63,2,0))","v":""},{"$f":"IF(B517=\"\",\"\",VLOOKUP(B517,Colab!$C$14:$E$63,3,0))","v":""},null,{"$f":"IF(E517=\"\",\"\",VLOOKUP(E517,Treinamentos!$B$13:$G$42,5,0))","v":""},null,null,null,null,null,{"$f":"IF(E517=\"\",\"\",VLOOKUP(E517,Treinamentos!$B$13:$G$42,6,0))","v":""}]
[null,null,{"$f":"IF(B518=\"\",\"\",VLOOKUP(B518,Colab!$C$14:$E$63,2,0))","v":""},{"$f":"IF(B518=\"\",\"\",VLOOKUP(B518,Colab!$C$14:$E$63,3,0))","v":""},null,{"$f":"IF(E518=\"\",\"\",VLOOKUP(E518,Treinamentos!$B$13:$G$42,5,0))","v":""},null,null,null,null,null,{"$f":"IF(E518=\"\",\"\",VLOOKUP(E518,Treinamentos!$B$13:$G$42,6,0))","v":""}]
[null,null,{"$f":"IF(B519=\"\",\"\",VLOOKUP(B519,Colab!$C$14:$E$63,2,0))","v":""},{"$f":"IF(B519=\"\",\"\",VLOOKUP(B519,Colab!$C$14:$E$63,3,0))","v":""},null,{"$f":"IF(E519=\"\",\"\",VLOOKUP(E519,Treinamentos!$B$13:$G$42,5,0))","v":""},null,null,null,null,null,{"$f":"IF(E519=\"\",\"\",VLOOKUP(E519,Treinamentos!$B$13:$G$42,6,0))","v":""}]
[null,null,{"$f":"IF(B520=\"\",\"\",VLOOKUP(B520,Colab!$C$14:$E$63,2,0))","v":""},{"$f":"IF(B520=\"\",\"\",VLOOKUP(B520,Colab!$C$14:$E$63,3,0))","v":""},null,{"$f":"IF(E520=\"\",\"\",VLOOKUP(E520,Treinamentos!$B$13:$G$42,5,0))","v":""},null,null,null,null,null,{"$f":"IF(E520=\"\",\"\",VLOOKUP(E520,Treinamentos!$B$13:$G$42,6,0))","v":""}]
[null,null,{"$f":"IF(B521=\"\",\"\",VLOOKUP(B521,Colab!$C$14:$E$63,2,0))","v":""},{"$f":"IF(B521=\"\",\"\",VLOOKUP(B521,Colab!$C$14:$E$63,3,0))","v":""},null,{"$f":"IF(E521=\"\",\"\",VLOOKUP(E521,Treinamentos!$B$13:$G$42,5,0))","v":""},null,null,null,null,null,{"$f":"IF(E521=\"\",\"\",VLOOKUP(E521,Treinamentos!$B$13:$G$42,6,0))","v":""}]
[null,null,{"$f":"IF(B522=\"\",\"\",VLOOKUP(B522,Colab!$C$14:$E$63,2,0))","v":""},{"$f":"IF(B522=\"\",\"\",VLOOKUP(B522,Colab!$C$14:$E$63,3,0))","v":""},null,{"$f":"IF(E522=\"\",\"\",VLOOKUP(E522,Treinamentos!$B$13:$G$42,5,0))","v":""},null,null,null,null,null,{"$f":"IF(E522=\"\",\"\",VLOOKUP(E522,Treinamentos!$B$13:$G$42,6,0))","v":""}]
[null,null,{"$f":"IF(B523=\"\",\"\",VLOOKUP(B523,Colab!$C$14:$E$63,2,0))","v":""},{"$f":"IF(B523=\"\",\"\",VLOOKUP(B523,Colab!$C$14:$E$63,3,0))","v":""},null,{"$f":"IF(E523=\"\",\"\",VLOOKUP(E523,Treinamentos!$B$13:$G$42,5,0))","v":""},null,null,null,null,null,{"$f":"IF(E523=\"\",\"\",VLOOKUP(E523,Treinamentos!$B$13:$G$42,6,0))","v":""}]
[null,null,{"$f":"IF(B524=\"\",\"\",VLOOKUP(B524,Colab!$C$14:$E$63,2,0))","v":""},{"$f":"IF(B524=\"\",\"\",VLOOKUP(B524,Colab!$C$14:$E$63,3,0))","v":""},null,{"$f":"IF(E524=\"\",\"\",VLOOKUP(E524,Treinamentos!$B$13:$G$42,5,0))","v":""},null,null,null,null,null,{"$f":"IF(E524=\"\",\"\",VLOOKUP(E524,Treinamentos!$B$13:$G$42,6,0))","v":""}]
[null,null,{"$f":"IF(B525=\"\",\"\",VLOOKUP(B525,Colab!$C$14:$E$63,2,0))","v":""},{"$f":"IF(B525=\"\",\"\",VLOOKUP(B525,Colab!$C$14:$E$63,3,0))","v":""},null,{"$f":"IF(E525=\"\",\"\",VLOOKUP(E525,Treinamentos!$B$13:$G$42,5,0))","v":""},null,null,null,null,null,{"$f":"IF(E525=\"\",\"\",VLOOKUP(E525,Treinamentos!$B$13:$G$42,6,0))","v":""}]
[null,null,{"$f":"IF(B526=\"\",\"\",VLOOKUP(B526,Colab!$C$14:$E$63,2,0))","v":""},{"$f":"IF(B526=\"\",\"\",VLOOKUP(B526,Colab!$C$14:$E$63,3,0))","v":""},null,{"$f":"IF(E526=\"\",\"\",VLOOKUP(E526,Treinamentos!$B$13:$G$42,5,0))","v":""},null,null,null,null,null,{"$f":"IF(E526=\"\",\"\",VLOOKUP(E526,Treinamentos!$B$13:$G$42,6,0))","v":""}]
[null,null,{"$f":"IF(B527=\"\",\"\",VLOOKUP(B527,Colab!$C$14:$E$63,2,0))","v":""},{"$f":"IF(B527=\"\",\"\",VLOOKUP(B527,Colab!$C$14:$E$63,3,0))","v":""},null,{"$f":"IF(E527=\"\",\"\",VLOOKUP(E527,Treinamentos!$B$13:$G$42,5,0))","v":""},null,null,null,null,null,{"$f":"IF(E527=\"\",\"\",VLOOKUP(E527,Treinamentos!$B$13:$G$42,6,0))","v":""}]
[null,null,{"$f":"IF(B528=\"\",\"\",VLOOKUP(B528,Colab!$C$14:$E$63,2,0))","v":""},{"$f":"IF(B528=\"\",\"\",VLOOKUP(B528,Colab!$C$14:$E$63,3,0))","v":""},null,{"$f":"IF(E528=\"\",\"\",VLOOKUP(E528,Treinamentos!$B$13:$G$42,5,0))","v":""},null,null,null,null,null,{"$f":"IF(E528=\"\",\"\",VLOOKUP(E528,Treinamentos!$B$13:$G$42,6,0))","v":""}]
[null,null,{"$f":"IF(B529=\"\",\"\",VLOOKUP(B529,Colab!$C$14:$E$63,2,0))","v":""},{"$f":"IF(B529=\"\",\"\",VLOOKUP(B529,Colab!$C$14:$E$63,3,0))","v":""},null,{"$f":"IF(E529=\"\",\"\",VLOOKUP(E529,Treinamentos!$B$13:$G$42,5,0))","v":""},null,null,null,null,null,{"$f":"IF(E529=\"\",\"\",VLOOKUP(E529,Treinamentos!$B$13:$G$42,6,0))","v":""}]
[null,null,{"$f":"IF(B530=\"\",\"\",VLOOKUP(B530,Colab!$C$14:$E$63,2,0))","v":""},{"$f":"IF(B530=\"\",\"\",VLOOKUP(B530,Colab!$C$14:$E$63,3,0))","v":""},null,{"$f":"IF(E530=\"\",\"\",VLOOKUP(E530,Treinamentos!$B$13:$G$42,5,0))","v":""},null,null,null,null,null,{"$f":"IF(E530=\"\",\"\",VLOOKUP(E530,Treinamentos!$B$13:$G$42,6,0))","v":""}]
[null,null,{"$f":"IF(B531=\"\",\"\",VLOOKUP(B531,Colab!$C$14:$E$63,2,0))","v":""},{"$f":"IF(B531=\"\",\"\",VLOOKUP(B531,Colab!$C$14:$E$63,3,0))","v":""},null,{"$f":"IF(E531=\"\",\"\",VLOOKUP(E531,Treinamentos!$B$13:$G$42,5,0))","v":""},null,null,null,null,null,{"$f":"IF(E531=\"\",\"\",VLOOKUP(E531,Treinamentos!$B$13:$G$42,6,0))","v":""}]
[null,null,{"$f":"IF(B532=\"\",\"\",VLOOKUP(B532,Colab!$C$14:$E$63,2,0))","v":""},{"$f":"IF(B532=\"\",\"\",VLOOKUP(B532,Colab!$C$14:$E$63,3,0))","v":""},null,{"$f":"IF(E532=\"\",\"\",VLOOKUP(E532,Treinamentos!$B$13:$G$42,5,0))","v":""},null,null,null,null,null,{"$f":"IF(E532=\"\",\"\",VLOOKUP(E532,Treinamentos!$B$13:$G$42,6,0))","v":""}]
[null,null,{"$f":"IF(B533=\"\",\"\",VLOOKUP(B533,Colab!$C$14:$E$63,2,0))","v":""},{"$f":"IF(B533=\"\",\"\",VLOOKUP(B533,Colab!$C$14:$E$63,3,0))","v":""},null,{"$f":"IF(E533=\"\",\"\",VLOOKUP(E533,Treinamentos!$B$13:$G$42,5,0))","v":""},null,null,null,null,null,{"$f":"IF(E533=\"\",\"\",VLOOKUP(E533,Treinamentos!$B$13:$G$42,6,0))","v":""}]
[null,null,{"$f":"IF(B534=\"\",\"\",VLOOKUP(B534,Colab!$C$14:$E$63,2,0))","v":""},{"$f":"IF(B534=\"\",\"\",VLOOKUP(B534,Colab!$C$14:$E$63,3,0))","v":""},null,{"$f":"IF(E534=\"\",\"\",VLOOKUP(E534,Treinamentos!$B$13:$G$42,5,0))","v":""},null,null,null,null,null,{"$f":"IF(E534=\"\",\"\",VLOOKUP(E534,Treinamentos!$B$13:$G$42,6,0))","v":""}]
[null,null,{"$f":"IF(B535=\"\",\"\",VLOOKUP(B535,Colab!$C$14:$E$63,2,0))","v":""},{"$f":"IF(B535=\"\",\"\",VLOOKUP(B535,Colab!$C$14:$E$63,3,0))","v":""},null,{"$f":"IF(E535=\"\",\"\",VLOOKUP(E535,Treinamentos!$B$13:$G$42,5,0))","v":""},null,null,null,null,null,{"$f":"IF(E535=\"\",\"\",VLOOKUP(E535,Treinamentos!$B$13:$G$42,6,0))","v":""}]
[null,null,{"$f":"IF(B536=\"\",\"\",VLOOKUP(B536,Colab!$C$14:$E$63,2,0))","v":""},{"$f":"IF(B536=\"\",\"\",VLOOKUP(B536,Colab!$C$14:$E$63,3,0))","v":""},null,{"$f":"IF(E536=\"\",\"\",VLOOKUP(E536,Treinamentos!$B$13:$G$42,5,0))","v":""},null,null,null,null,null,{"$f":"IF(E536=\"\",\"\",VLOOKUP(E536,Treinamentos!$B$13:$G$42,6,0))","v":""}]
[null,null,{"$f":"IF(B537=\"\",\"\",VLOOKUP(B537,Colab!$C$14:$E$63,2,0))","v":""},{"$f":"IF(B537=\"\",\"\",VLOOKUP(B537,Colab!$C$14:$E$63,3,0))","v":""},null,{"$f":"IF(E537=\"\",\"\",VLOOKUP(E537,Treinamentos!$B$13:$G$42,5,0))","v":""},null,null,null,null,null,{"$f":"IF(E537=\"\",\"\",VLOOKUP(E537,Treinamentos!$B$13:$G$42,6,0))","v":""}]
[null,null,{"$f":"IF(B538=\"\",\"\",VLOOKUP(B538,Colab!$C$14:$E$63,2,0))","v":""},{"$f":"IF(B538=\"\",\"\",VLOOKUP(B538,Colab!$C$14:$E$63,3,0))","v":""},null,{"$f":"IF(E538=\"\",\"\",VLOOKUP(E538,Treinamentos!$B$13:$G$42,5,0))","v":""},null,null,null,null,null,{"$f":"IF(E538=\"\",\"\",VLOOKUP(E538,Treinamentos!$B$13:$G$42,6,0))","v":""}]
[null,null,{"$f":"IF(B539=\"\",\"\",VLOOKUP(B539,Colab!$C$14:$E$63,2,0))","v":""},{"$f":"IF(B539=\"\",\"\",VLOOKUP(B539,Colab!$C$14:$E$63,3,0))","v":""},null,{"$f":"IF(E539=\"\",\"\",VLOOKUP(E539,Treinamentos!$B$13:$G$42,5,0))","v":""},null,null,null,null,null,{"$f":"IF(E539=\"\",\"\",VLOOKUP(E539,Treinamentos!$B$13:$G$42,6,0))","v":""}]
[null,null,{"$f":"IF(B540=\"\",\"\",VLOOKUP(B540,Colab!$C$14:$E$63,2,0))","v":""},{"$f":"IF(B540=\"\",\"\",VLOOKUP(B540,Colab!$C$14:$E$63,3,0))","v":""},null,{"$f":"IF(E540=\"\",\"\",VLOOKUP(E540,Treinamentos!$B$13:$G$42,5,0))","v":""},null,null,null,null,null,{"$f":"IF(E540=\"\",\"\",VLOOKUP(E540,Treinamentos!$B$13:$G$42,6,0))","v":""}]
[null,null,{"$f":"IF(B541=\"\",\"\",VLOOKUP(B541,Colab!$C$14:$E$63,2,0))","v":""},{"$f":"IF(B541=\"\",\"\",VLOOKUP(B541,Colab!$C$14:$E$63,3,0))","v":""},null,{"$f":"IF(E541=\"\",\"\",VLOOKUP(E541,Treinamentos!$B$13:$G$42,5,0))","v":""},null,null,null,null,null,{"$f":"IF(E541=\"\",\"\",VLOOKUP(E541,Treinamentos!$B$13:$G$42,6,0))","v":""}]
[null,null,{"$f":"IF(B542=\"\",\"\",VLOOKUP(B542,Colab!$C$14:$E$63,2,0))","v":""},{"$f":"IF(B542=\"\",\"\",VLOOKUP(B542,Colab!$C$14:$E$63,3,0))","v":""},null,{"$f":"IF(E542=\"\",\"\",VLOOKUP(E542,Treinamentos!$B$13:$G$42,5,0))","v":""},null,null,null,null,null,{"$f":"IF(E542=\"\",\"\",VLOOKUP(E542,Treinamentos!$B$13:$G$42,6,0))","v":""}]
[null,null,{"$f":"IF(B543=\"\",\"\",VLOOKUP(B543,Colab!$C$14:$E$63,2,0))","v":""},{"$f":"IF(B543=\"\",\"\",VLOOKUP(B543,Colab!$C$14:$E$63,3,0))","v":""},null,{"$f":"IF(E543=\"\",\"\",VLOOKUP(E543,Treinamentos!$B$13:$G$42,5,0))","v":""},null,null,null,null,null,{"$f":"IF(E543=\"\",\"\",VLOOKUP(E543,Treinamentos!$B$13:$G$42,6,0))","v":""}]
[null,null,{"$f":"IF(B544=\"\",\"\",VLOOKUP(B544,Colab!$C$14:$E$63,2,0))","v":""},{"$f":"IF(B544=\"\",\"\",VLOOKUP(B544,Colab!$C$14:$E$63,3,0))","v":""},null,{"$f":"IF(E544=\"\",\"\",VLOOKUP(E544,Treinamentos!$B$13:$G$42,5,0))","v":""},null,null,null,null,null,{"$f":"IF(E544=\"\",\"\",VLOOKUP(E544,Treinamentos!$B$13:$G$42,6,0))","v":""}]
[null,null,{"$f":"IF(B545=\"\",\"\",VLOOKUP(B545,Colab!$C$14:$E$63,2,0))","v":""},{"$f":"IF(B545=\"\",\"\",VLOOKUP(B545,Colab!$C$14:$E$63,3,0))","v":""},null,{"$f":"IF(E545=\"\",\"\",VLOOKUP(E545,Treinamentos!$B$13:$G$42,5,0))","v":""},null,null,null,null,null,{"$f":"IF(E545=\"\",\"\",VLOOKUP(E545,Treinamentos!$B$13:$G$42,6,0))","v":""}]
[null,null,{"$f":"IF(B546=\"\",\"\",VLOOKUP(B546,Colab!$C$14:$E$63,2,0))","v":""},{"$f":"IF(B546=\"\",\"\",VLOOKUP(B546,Colab!$C$14:$E$63,3,0))","v":""},null,{"$f":"IF(E546=\"\",\"\",VLOOKUP(E546,Treinamentos!$B$13:$G$42,5,0))","v":""},null,null,null,null,null,{"$f":"IF(E546=\"\",\"\",VLOOKUP(E546,Treinamentos!$B$13:$G$42,6,0))","v":""}]
[null,null,{"$f":"IF(B547=\"\",\"\",VLOOKUP(B547,Colab!$C$14:$E$63,2,0))","v":""},{"$f":"IF(B547=\"\",\"\",VLOOKUP(B547,Colab!$C$14:$E$63,3,0))","v":""},null,{"$f":"IF(E547=\"\",\"\",VLOOKUP(E547,Treinamentos!$B$13:$G$42,5,0))","v":""},null,null,null,null,null,{"$f":"IF(E547=\"\",\"\",VLOOKUP(E547,Treinamentos!$B$13:$G$42,6,0))","v":""}]
[null,null,{"$f":"IF(B548=\"\",\"\",VLOOKUP(B548,Colab!$C$14:$E$63,2,0))","v":""},{"$f":"IF(B548=\"\",\"\",VLOOKUP(B548,Colab!$C$14:$E$63,3,0))","v":""},null,{"$f":"IF(E548=\"\",\"\",VLOOKUP(E548,Treinamentos!$B$13:$G$42,5,0))","v":""},null,null,null,null,null,{"$f":"IF(E548=\"\",\"\",VLOOKUP(E548,Treinamentos!$B$13:$G$42,6,0))","v":""}]
[null,null,{"$f":"IF(B549=\"\",\"\",VLOOKUP(B549,Colab!$C$14:$E$63,2,0))","v":""},{"$f":"IF(B549=\"\",\"\",VLOOKUP(B549,Colab!$C$14:$E$63,3,0))","v":""},null,{"$f":"IF(E549=\"\",\"\",VLOOKUP(E549,Treinamentos!$B$13:$G$42,5,0))","v":""},null,null,null,null,null,{"$f":"IF(E549=\"\",\"\",VLOOKUP(E549,Treinamentos!$B$13:$G$42,6,0))","v":""}]
[null,null,{"$f":"IF(B550=\"\",\"\",VLOOKUP(B550,Colab!$C$14:$E$63,2,0))","v":""},{"$f":"IF(B550=\"\",\"\",VLOOKUP(B550,Colab!$C$14:$E$63,3,0))","v":""},null,{"$f":"IF(E550=\"\",\"\",VLOOKUP(E550,Treinamentos!$B$13:$G$42,5,0))","v":""},null,null,null,null,null,{"$f":"IF(E550=\"\",\"\",VLOOKUP(E550,Treinamentos!$B$13:$G$42,6,0))","v":""}]
[null,null,{"$f":"IF(B551=\"\",\"\",VLOOKUP(B551,Colab!$C$14:$E$63,2,0))","v":""},{"$f":"IF(B551=\"\",\"\",VLOOKUP(B551,Colab!$C$14:$E$63,3,0))","v":""},null,{"$f":"IF(E551=\"\",\"\",VLOOKUP(E551,Treinamentos!$B$13:$G$42,5,0))","v":""},null,null,null,null,null,{"$f":"IF(E551=\"\",\"\",VLOOKUP(E551,Treinamentos!$B$13:$G$42,6,0))","v":""}]
[null,null,{"$f":"IF(B552=\"\",\"\",VLOOKUP(B552,Colab!$C$14:$E$63,2,0))","v":""},{"$f":"IF(B552=\"\",\"\",VLOOKUP(B552,Colab!$C$14:$E$63,3,0))","v":""},null,{"$f":"IF(E552=\"\",\"\",VLOOKUP(E552,Treinamentos!$B$13:$G$42,5,0))","v":""},null,null,null,null,null,{"$f":"IF(E552=\"\",\"\",VLOOKUP(E552,Treinamentos!$B$13:$G$42,6,0))","v":""}]
[null,null,{"$f":"IF(B553=\"\",\"\",VLOOKUP(B553,Colab!$C$14:$E$63,2,0))","v":""},{"$f":"IF(B553=\"\",\"\",VLOOKUP(B553,Colab!$C$14:$E$63,3,0))","v":""},null,{"$f":"IF(E553=\"\",\"\",VLOOKUP(E553,Treinamentos!$B$13:$G$42,5,0))","v":""},null,null,null,null,null,{"$f":"IF(E553=\"\",\"\",VLOOKUP(E553,Treinamentos!$B$13:$G$42,6,0))","v":""}]
[null,null,{"$f":"IF(B554=\"\",\"\",VLOOKUP(B554,Colab!$C$14:$E$63,2,0))","v":""},{"$f":"IF(B554=\"\",\"\",VLOOKUP(B554,Colab!$C$14:$E$63,3,0))","v":""},null,{"$f":"IF(E554=\"\",\"\",VLOOKUP(E554,Treinamentos!$B$13:$G$42,5,0))","v":""},null,null,null,null,null,{"$f":"IF(E554=\"\",\"\",VLOOKUP(E554,Treinamentos!$B$13:$G$42,6,0))","v":""}]
[null,null,{"$f":"IF(B555=\"\",\"\",VLOOKUP(B555,Colab!$C$14:$E$63,2,0))","v":""},{"$f":"IF(B555=\"\",\"\",VLOOKUP(B555,Colab!$C$14:$E$63,3,0))","v":""},null,{"$f":"IF(E555=\"\",\"\",VLOOKUP(E555,Treinamentos!$B$13:$G$42,5,0))","v":""},null,null,null,null,null,{"$f":"IF(E555=\"\",\"\",VLOOKUP(E555,Treinamentos!$B$13:$G$42,6,0))","v":""}]
[null,null,{"$f":"IF(B556=\"\",\"\",VLOOKUP(B556,Colab!$C$14:$E$63,2,0))","v":""},{"$f":"IF(B556=\"\",\"\",VLOOKUP(B556,Colab!$C$14:$E$63,3,0))","v":""},null,{"$f":"IF(E556=\"\",\"\",VLOOKUP(E556,Treinamentos!$B$13:$G$42,5,0))","v":""},null,null,null,null,null,{"$f":"IF(E556=\"\",\"\",VLOOKUP(E556,Treinamentos!$B$13:$G$42,6,0))","v":""}]
[null,null,{"$f":"IF(B557=\"\",\"\",VLOOKUP(B557,Colab!$C$14:$E$63,2,0))","v":""},{"$f":"IF(B557=\"\",\"\",VLOOKUP(B557,Colab!$C$14:$E$63,3,0))","v":""},null,{"$f":"IF(E557=\"\",\"\",VLOOKUP(E557,Treinamentos!$B$13:$G$42,5,0))","v":""},null,null,null,null,null,{"$f":"IF(E557=\"\",\"\",VLOOKUP(E557,Treinamentos!$B$13:$G$42,6,0))","v":""}]
[null,null,{"$f":"IF(B558=\"\",\"\",VLOOKUP(B558,Colab!$C$14:$E$63,2,0))","v":""},{"$f":"IF(B558=\"\",\"\",VLOOKUP(B558,Colab!$C$14:$E$63,3,0))","v":""},null,{"$f":"IF(E558=\"\",\"\",VLOOKUP(E558,Treinamentos!$B$13:$G$42,5,0))","v":""},null,null,null,null,null,{"$f":"IF(E558=\"\",\"\",VLOOKUP(E558,Treinamentos!$B$13:$G$42,6,0))","v":""}]
[null,null,{"$f":"IF(B559=\"\",\"\",VLOOKUP(B559,Colab!$C$14:$E$63,2,0))","v":""},{"$f":"IF(B559=\"\",\"\",VLOOKUP(B559,Colab!$C$14:$E$63,3,0))","v":""},null,{"$f":"IF(E559=\"\",\"\",VLOOKUP(E559,Treinamentos!$B$13:$G$42,5,0))","v":""},null,null,null,null,null,{"$f":"IF(E559=\"\",\"\",VLOOKUP(E559,Treinamentos!$B$13:$G$42,6,0))","v":""}]
[null,null,{"$f":"IF(B560=\"\",\"\",VLOOKUP(B560,Colab!$C$14:$E$63,2,0))","v":""},{"$f":"IF(B560=\"\",\"\",VLOOKUP(B560,Colab!$C$14:$E$63,3,0))","v":""},null,{"$f":"IF(E560=\"\",\"\",VLOOKUP(E560,Treinamentos!$B$13:$G$42,5,0))","v":""},null,null,null,null,null,{"$f":"IF(E560=\"\",\"\",VLOOKUP(E560,Treinamentos!$B$13:$G$42,6,0))","v":""}]
[null,null,{"$f":"IF(B561=\"\",\"\",VLOOKUP(B561,Colab!$C$14:$E$63,2,0))","v":""},{"$f":"IF(B561=\"\",\"\",VLOOKUP(B561,Colab!$C$14:$E$63,3,0))","v":""},null,{"$f":"IF(E561=\"\",\"\",VLOOKUP(E561,Treinamentos!$B$13:$G$42,5,0))","v":""},null,null,null,null,null,{"$f":"IF(E561=\"\",\"\",VLOOKUP(E561,Treinamentos!$B$13:$G$42,6,0))","v":""}]
[null,null,{"$f":"IF(B562=\"\",\"\",VLOOKUP(B562,Colab!$C$14:$E$63,2,0))","v":""},{"$f":"IF(B562=\"\",\"\",VLOOKUP(B562,Colab!$C$14:$E$63,3,0))","v":""},null,{"$f":"IF(E562=\"\",\"\",VLOOKUP(E562,Treinamentos!$B$13:$G$42,5,0))","v":""},null,null,null,null,null,{"$f":"IF(E562=\"\",\"\",VLOOKUP(E562,Treinamentos!$B$13:$G$42,6,0))","v":""}]
[null,null,{"$f":"IF(B563=\"\",\"\",VLOOKUP(B563,Colab!$C$14:$E$63,2,0))","v":""},{"$f":"IF(B563=\"\",\"\",VLOOKUP(B563,Colab!$C$14:$E$63,3,0))","v":""},null,{"$f":"IF(E563=\"\",\"\",VLOOKUP(E563,Treinamentos!$B$13:$G$42,5,0))","v":""},null,null,null,null,null,{"$f":"IF(E563=\"\",\"\",VLOOKUP(E563,Treinamentos!$B$13:$G$42,6,0))","v":""}]
[null,null,{"$f":"IF(B564=\"\",\"\",VLOOKUP(B564,Colab!$C$14:$E$63,2,0))","v":""},{"$f":"IF(B564=\"\",\"\",VLOOKUP(B564,Colab!$C$14:$E$63,3,0))","v":""},null,{"$f":"IF(E564=\"\",\"\",VLOOKUP(E564,Treinamentos!$B$13:$G$42,5,0))","v":""},null,null,null,null,null,{"$f":"IF(E564=\"\",\"\",VLOOKUP(E564,Treinamentos!$B$13:$G$42,6,0))","v":""}]
[null,null,{"$f":"IF(B565=\"\",\"\",VLOOKUP(B565,Colab!$C$14:$E$63,2,0))","v":""},{"$f":"IF(B565=\"\",\"\",VLOOKUP(B565,Colab!$C$14:$E$63,3,0))","v":""},null,{"$f":"IF(E565=\"\",\"\",VLOOKUP(E565,Treinamentos!$B$13:$G$42,5,0))","v":""},null,null,null,null,null,{"$f":"IF(E565=\"\",\"\",VLOOKUP(E565,Treinamentos!$B$13:$G$42,6,0))","v":""}]
[null,null,{"$f":"IF(B566=\"\",\"\",VLOOKUP(B566,Colab!$C$14:$E$63,2,0))","v":""},{"$f":"IF(B566=\"\",\"\",VLOOKUP(B566,Colab!$C$14:$E$63,3,0))","v":""},null,{"$f":"IF(E566=\"\",\"\",VLOOKUP(E566,Treinamentos!$B$13:$G$42,5,0))","v":""},null,null,null,null,null,{"$f":"IF(E566=\"\",\"\",VLOOKUP(E566,Treinamentos!$B$13:$G$42,6,0))","v":""}]
[null,null,{"$f":"IF(B567=\"\",\"\",VLOOKUP(B567,Colab!$C$14:$E$63,2,0))","v":""},{"$f":"IF(B567=\"\",\"\",VLOOKUP(B567,Colab!$C$14:$E$63,3,0))","v":""},null,{"$f":"IF(E567=\"\",\"\",VLOOKUP(E567,Treinamentos!$B$13:$G$42,5,0))","v":""},null,null,null,null,null,{"$f":"IF(E567=\"\",\"\",VLOOKUP(E567,Treinamentos!$B$13:$G$42,6,0))","v":""}]
[null,null,{"$f":"IF(B568=\"\",\"\",VLOOKUP(B568,Colab!$C$14:$E$63,2,0))","v":""},{"$f":"IF(B568=\"\",\"\",VLOOKUP(B568,Colab!$C$14:$E$63,3,0))","v":""},null,{"$f":"IF(E568=\"\",\"\",VLOOKUP(E568,Treinamentos!$B$13:$G$42,5,0))","v":""},null,null,null,null,null,{"$f":"IF(E568=\"\",\"\",VLOOKUP(E568,Treinamentos!$B$13:$G$42,6,0))","v":""}]
[null,null,{"$f":"IF(B569=\"\",\"\",VLOOKUP(B569,Colab!$C$14:$E$63,2,0))","v":""},{"$f":"IF(B569=\"\",\"\",VLOOKUP(B569,Colab!$C$14:$E$63,3,0))","v":""},null,{"$f":"IF(E569=\"\",\"\",VLOOKUP(E569,Treinamentos!$B$13:$G$42,5,0))","v":""},null,null,null,null,null,{"$f":"IF(E569=\"\",\"\",VLOOKUP(E569,Treinamentos!$B$13:$G$42,6,0))","v":""}]
[null,null,{"$f":"IF(B570=\"\",\"\",VLOOKUP(B570,Colab!$C$14:$E$63,2,0))","v":""},{"$f":"IF(B570=\"\",\"\",VLOOKUP(B570,Colab!$C$14:$E$63,3,0))","v":""},null,{"$f":"IF(E570=\"\",\"\",VLOOKUP(E570,Treinamentos!$B$13:$G$42,5,0))","v":""},null,null,null,null,null,{"$f":"IF(E570=\"\",\"\",VLOOKUP(E570,Treinamentos!$B$13:$G$42,6,0))","v":""}]
[null,null,{"$f":"IF(B571=\"\",\"\",VLOOKUP(B571,Colab!$C$14:$E$63,2,0))","v":""},{"$f":"IF(B571=\"\",\"\",VLOOKUP(B571,Colab!$C$14:$E$63,3,0))","v":""},null,{"$f":"IF(E571=\"\",\"\",VLOOKUP(E571,Treinamentos!$B$13:$G$42,5,0))","v":""},null,null,null,null,null,{"$f":"IF(E571=\"\",\"\",VLOOKUP(E571,Treinamentos!$B$13:$G$42,6,0))","v":""}]
[null,null,{"$f":"IF(B572=\"\",\"\",VLOOKUP(B572,Colab!$C$14:$E$63,2,0))","v":""},{"$f":"IF(B572=\"\",\"\",VLOOKUP(B572,Colab!$C$14:$E$63,3,0))","v":""},null,{"$f":"IF(E572=\"\",\"\",VLOOKUP(E572,Treinamentos!$B$13:$G$42,5,0))","v":""},null,null,null,null,null,{"$f":"IF(E572=\"\",\"\",VLOOKUP(E572,Treinamentos!$B$13:$G$42,6,0))","v":""}]
[null,null,{"$f":"IF(B573=\"\",\"\",VLOOKUP(B573,Colab!$C$14:$E$63,2,0))","v":""},{"$f":"IF(B573=\"\",\"\",VLOOKUP(B573,Colab!$C$14:$E$63,3,0))","v":""},null,{"$f":"IF(E573=\"\",\"\",VLOOKUP(E573,Treinamentos!$B$13:$G$42,5,0))","v":""},null,null,null,null,null,{"$f":"IF(E573=\"\",\"\",VLOOKUP(E573,Treinamentos!$B$13:$G$42,6,0))","v":""}]
[null,null,{"$f":"IF(B574=\"\",\"\",VLOOKUP(B574,Colab!$C$14:$E$63,2,0))","v":""},{"$f":"IF(B574=\"\",\"\",VLOOKUP(B574,Colab!$C$14:$E$63,3,0))","v":""},null,{"$f":"IF(E574=\"\",\"\",VLOOKUP(E574,Treinamentos!$B$13:$G$42,5,0))","v":""},null,null,null,null,null,{"$f":"IF(E574=\"\",\"\",VLOOKUP(E574,Treinamentos!$B$13:$G$42,6,0))","v":""}]
[null,null,{"$f":"IF(B575=\"\",\"\",VLOOKUP(B575,Colab!$C$14:$E$63,2,0))","v":""},{"$f":"IF(B575=\"\",\"\",VLOOKUP(B575,Colab!$C$14:$E$63,3,0))","v":""},null,{"$f":"IF(E575=\"\",\"\",VLOOKUP(E575,Treinamentos!$B$13:$G$42,5,0))","v":""},null,null,null,null,null,{"$f":"IF(E575=\"\",\"\",VLOOKUP(E575,Treinamentos!$B$13:$G$42,6,0))","v":""}]
[null,null,{"$f":"IF(B576=\"\",\"\",VLOOKUP(B576,Colab!$C$14:$E$63,2,0))","v":""},{"$f":"IF(B576=\"\",\"\",VLOOKUP(B576,Colab!$C$14:$E$63,3,0))","v":""},null,{"$f":"IF(E576=\"\",\"\",VLOOKUP(E576,Treinamentos!$B$13:$G$42,5,0))","v":""},null,null,null,null,null,{"$f":"IF(E576=\"\",\"\",VLOOKUP(E576,Treinamentos!$B$13:$G$42,6,0))","v":""}]
[null,null,{"$f":"IF(B577=\"\",\"\",VLOOKUP(B577,Colab!$C$14:$E$63,2,0))","v":""},{"$f":"IF(B577=\"\",\"\",VLOOKUP(B577,Colab!$C$14:$E$63,3,0))","v":""},null,{"$f":"IF(E577=\"\",\"\",VLOOKUP(E577,Treinamentos!$B$13:$G$42,5,0))","v":""},null,null,null,null,null,{"$f":"IF(E577=\"\",\"\",VLOOKUP(E577,Treinamentos!$B$13:$G$42,6,0))","v":""}]
[null,null,{"$f":"IF(B578=\"\",\"\",VLOOKUP(B578,Colab!$C$14:$E$63,2,0))","v":""},{"$f":"IF(B578=\"\",\"\",VLOOKUP(B578,Colab!$C$14:$E$63,3,0))","v":""},null,{"$f":"IF(E578=\"\",\"\",VLOOKUP(E578,Treinamentos!$B$13:$G$42,5,0))","v":""},null,null,null,null,null,{"$f":"IF(E578=\"\",\"\",VLOOKUP(E578,Treinamentos!$B$13:$G$42,6,0))","v":""}]
[null,null,{"$f":"IF(B579=\"\",\"\",VLOOKUP(B579,Colab!$C$14:$E$63,2,0))","v":""},{"$f":"IF(B579=\"\",\"\",VLOOKUP(B579,Colab!$C$14:$E$63,3,0))","v":""},null,{"$f":"IF(E579=\"\",\"\",VLOOKUP(E579,Treinamentos!$B$13:$G$42,5,0))","v":""},null,null,null,null,null,{"$f":"IF(E579=\"\",\"\",VLOOKUP(E579,Treinamentos!$B$13:$G$42,6,0))","v":""}]
[null,null,{"$f":"IF(B580=\"\",\"\",VLOOKUP(B580,Colab!$C$14:$E$63,2,0))","v":""},{"$f":"IF(B580=\"\",\"\",VLOOKUP(B580,Colab!$C$14:$E$63,3,0))","v":""},null,{"$f":"IF(E580=\"\",\"\",VLOOKUP(E580,Treinamentos!$B$13:$G$42,5,0))","v":""},null,null,null,null,null,{"$f":"IF(E580=\"\",\"\",VLOOKUP(E580,Treinamentos!$B$13:$G$42,6,0))","v":""}]
[null,null,{"$f":"IF(B581=\"\",\"\",VLOOKUP(B581,Colab!$C$14:$E$63,2,0))","v":""},{"$f":"IF(B581=\"\",\"\",VLOOKUP(B581,Colab!$C$14:$E$63,3,0))","v":""},null,{"$f":"IF(E581=\"\",\"\",VLOOKUP(E581,Treinamentos!$B$13:$G$42,5,0))","v":""},null,null,null,null,null,{"$f":"IF(E581=\"\",\"\",VLOOKUP(E581,Treinamentos!$B$13:$G$42,6,0))","v":""}]
[null,null,{"$f":"IF(B582=\"\",\"\",VLOOKUP(B582,Colab!$C$14:$E$63,2,0))","v":""},{"$f":"IF(B582=\"\",\"\",VLOOKUP(B582,Colab!$C$14:$E$63,3,0))","v":""},null,{"$f":"IF(E582=\"\",\"\",VLOOKUP(E582,Treinamentos!$B$13:$G$42,5,0))","v":""},null,null,null,null,null,{"$f":"IF(E582=\"\",\"\",VLOOKUP(E582,Treinamentos!$B$13:$G$42,6,0))","v":""}]
[null,null,{"$f":"IF(B583=\"\",\"\",VLOOKUP(B583,Colab!$C$14:$E$63,2,0))","v":""},{"$f":"IF(B583=\"\",\"\",VLOOKUP(B583,Colab!$C$14:$E$63,3,0))","v":""},null,{"$f":"IF(E583=\"\",\"\",VLOOKUP(E583,Treinamentos!$B$13:$G$42,5,0))","v":""},null,null,null,null,null,{"$f":"IF(E583=\"\",\"\",VLOOKUP(E583,Treinamentos!$B$13:$G$42,6,0))","v":""}]
[null,null,{"$f":"IF(B584=\"\",\"\",VLOOKUP(B584,Colab!$C$14:$E$63,2,0))","v":""},{"$f":"IF(B584=\"\",\"\",VLOOKUP(B584,Colab!$C$14:$E$63,3,0))","v":""},null,{"$f":"IF(E584=\"\",\"\",VLOOKUP(E584,Treinamentos!$B$13:$G$42,5,0))","v":""},null,null,null,null,null,{"$f":"IF(E584=\"\",\"\",VLOOKUP(E584,Treinamentos!$B$13:$G$42,6,0))","v":""}]
[null,null,{"$f":"IF(B585=\"\",\"\",VLOOKUP(B585,Colab!$C$14:$E$63,2,0))","v":""},{"$f":"IF(B585=\"\",\"\",VLOOKUP(B585,Colab!$C$14:$E$63,3,0))","v":""},null,{"$f":"IF(E585=\"\",\"\",VLOOKUP(E585,Treinamentos!$B$13:$G$42,5,0))","v":""},null,null,null,null,null,{"$f":"IF(E585=\"\",\"\",VLOOKUP(E585,Treinamentos!$B$13:$G$42,6,0))","v":""}]
[null,null,{"$f":"IF(B586=\"\",\"\",VLOOKUP(B586,Colab!$C$14:$E$63,2,0))","v":""},{"$f":"IF(B586=\"\",\"\",VLOOKUP(B586,Colab!$C$14:$E$63,3,0))","v":""},null,{"$f":"IF(E586=\"\",\"\",VLOOKUP(E586,Treinamentos!$B$13:$G$42,5,0))","v":""},null,null,null,null,null,{"$f":"IF(E586=\"\",\"\",VLOOKUP(E586,Treinamentos!$B$13:$G$42,6,0))","v":""}]
[null,null,{"$f":"IF(B587=\"\",\"\",VLOOKUP(B587,Colab!$C$14:$E$63,2,0))","v":""},{"$f":"IF(B587=\"\",\"\",VLOOKUP(B587,Colab!$C$14:$E$63,3,0))","v":""},null,{"$f":"IF(E587=\"\",\"\",VLOOKUP(E587,Treinamentos!$B$13:$G$42,5,0))","v":""},null,null,null,null,null,{"$f":"IF(E587=\"\",\"\",VLOOKUP(E587,Treinamentos!$B$13:$G$42,6,0))","v":""}]
[null,null,{"$f":"IF(B588=\"\",\"\",VLOOKUP(B588,Colab!$C$14:$E$63,2,0))","v":""},{"$f":"IF(B588=\"\",\"\",VLOOKUP(B588,Colab!$C$14:$E$63,3,0))","v":""},null,{"$f":"IF(E588=\"\",\"\",VLOOKUP(E588,Treinamentos!$B$13:$G$42,5,0))","v":""},null,null,null,null,null,{"$f":"IF(E588=\"\",\"\",VLOOKUP(E588,Treinamentos!$B$13:$G$42,6,0))","v":""}]
[null,null,{"$f":"IF(B589=\"\",\"\",VLOOKUP(B589,Colab!$C$14:$E$63,2,0))","v":""},{"$f":"IF(B589=\"\",\"\",VLOOKUP(B589,Colab!$C$14:$E$63,3,0))","v":""},null,{"$f":"IF(E589=\"\",\"\",VLOOKUP(E589,Treinamentos!$B$13:$G$42,5,0))","v":""},null,null,null,null,null,{"$f":"IF(E589=\"\",\"\",VLOOKUP(E589,Treinamentos!$B$13:$G$42,6,0))","v":""}]
[null,null,{"$f":"IF(B590=\"\",\"\",VLOOKUP(B590,Colab!$C$14:$E$63,2,0))","v":""},{"$f":"IF(B590=\"\",\"\",VLOOKUP(B590,Colab!$C$14:$E$63,3,0))","v":""},null,{"$f":"IF(E590=\"\",\"\",VLOOKUP(E590,Treinamentos!$B$13:$G$42,5,0))","v":""},null,null,null,null,null,{"$f":"IF(E590=\"\",\"\",VLOOKUP(E590,Treinamentos!$B$13:$G$42,6,0))","v":""}]
[null,null,{"$f":"IF(B591=\"\",\"\",VLOOKUP(B591,Colab!$C$14:$E$63,2,0))","v":""},{"$f":"IF(B591=\"\",\"\",VLOOKUP(B591,Colab!$C$14:$E$63,3,0))","v":""},null,{"$f":"IF(E591=\"\",\"\",VLOOKUP(E591,Treinamentos!$B$13:$G$42,5,0))","v":""},null,null,null,null,null,{"$f":"IF(E591=\"\",\"\",VLOOKUP(E591,Treinamentos!$B$13:$G$42,6,0))","v":""}]
[null,null,{"$f":"IF(B592=\"\",\"\",VLOOKUP(B592,Colab!$C$14:$E$63,2,0))","v":""},{"$f":"IF(B592=\"\",\"\",VLOOKUP(B592,Colab!$C$14:$E$63,3,0))","v":""},null,{"$f":"IF(E592=\"\",\"\",VLOOKUP(E592,Treinamentos!$B$13:$G$42,5,0))","v":""},null,null,null,null,null,{"$f":"IF(E592=\"\",\"\",VLOOKUP(E592,Treinamentos!$B$13:$G$42,6,0))","v":""}]
[null,null,{"$f":"IF(B593=\"\",\"\",VLOOKUP(B593,Colab!$C$14:$E$63,2,0))","v":""},{"$f":"IF(B593=\"\",\"\",VLOOKUP(B593,Colab!$C$14:$E$63,3,0))","v":""},null,{"$f":"IF(E593=\"\",\"\",VLOOKUP(E593,Treinamentos!$B$13:$G$42,5,0))","v":""},null,null,null,null,null,{"$f":"IF(E593=\"\",\"\",VLOOKUP(E593,Treinamentos!$B$13:$G$42,6,0))","v":""}]
[null,null,{"$f":"IF(B594=\"\",\"\",VLOOKUP(B594,Colab!$C$14:$E$63,2,0))","v":""},{"$f":"IF(B594=\"\",\"\",VLOOKUP(B594,Colab!$C$14:$E$63,3,0))","v":""},null,{"$f":"IF(E594=\"\",\"\",VLOOKUP(E594,Treinamentos!$B$13:$G$42,5,0))","v":""},null,null,null,null,null,{"$f":"IF(E594=\"\",\"\",VLOOKUP(E594,Treinamentos!$B$13:$G$42,6,0))","v":""}]
[null,null,{"$f":"IF(B595=\"\",\"\",VLOOKUP(B595,Colab!$C$14:$E$63,2,0))","v":""},{"$f":"IF(B595=\"\",\"\",VLOOKUP(B595,Colab!$C$14:$E$63,3,0))","v":""},null,{"$f":"IF(E595=\"\",\"\",VLOOKUP(E595,Treinamentos!$B$13:$G$42,5,0))","v":""},null,null,null,null,null,{"$f":"IF(E595=\"\",\"\",VLOOKUP(E595,Treinamentos!$B$13:$G$42,6,0))","v":""}]
[null,null,{"$f":"IF(B596=\"\",\"\",VLOOKUP(B596,Colab!$C$14:$E$63,2,0))","v":""},{"$f":"IF(B596=\"\",\"\",VLOOKUP(B596,Colab!$C$14:$E$63,3,0))","v":""},null,{"$f":"IF(E596=\"\",\"\",VLOOKUP(E596,Treinamentos!$B$13:$G$42,5,0))","v":""},null,null,null,null,null,{"$f":"IF(E596=\"\",\"\",VLOOKUP(E596,Treinamentos!$B$13:$G$42,6,0))","v":""}]
[null,null,{"$f":"IF(B597=\"\",\"\",VLOOKUP(B597,Colab!$C$14:$E$63,2,0))","v":""},{"$f":"IF(B597=\"\",\"\",VLOOKUP(B597,Colab!$C$14:$E$63,3,0))","v":""},null,{"$f":"IF(E597=\"\",\"\",VLOOKUP(E597,Treinamentos!$B$13:$G$42,5,0))","v":""},null,null,null,null,null,{"$f":"IF(E597=\"\",\"\",VLOOKUP(E597,Treinamentos!$B$13:$G$42,6,0))","v":""}]
[null,null,{"$f":"IF(B598=\"\",\"\",VLOOKUP(B598,Colab!$C$14:$E$63,2,0))","v":""},{"$f":"IF(B598=\"\",\"\",VLOOKUP(B598,Colab!$C$14:$E$63,3,0))","v":""},null,{"$f":"IF(E598=\"\",\"\",VLOOKUP(E598,Treinamentos!$B$13:$G$42,5,0))","v":""},null,null,null,null,null,{"$f":"IF(E598=\"\",\"\",VLOOKUP(E598,Treinamentos!$B$13:$G$42,6,0))","v":""}]
[null,null,{"$f":"IF(B599=\"\",\"\",VLOOKUP(B599,Colab!$C$14:$E$63,2,0))","v":""},{"$f":"IF(B599=\"\",\"\",VLOOKUP(B599,Colab!$C$14:$E$63,3,0))","v":""},null,{"$f":"IF(E599=\"\",\"\",VLOOKUP(E599,Treinamentos!$B$13:$G$42,5,0))","v":""},null,null,null,null,null,{"$f":"IF(E599=\"\",\"\",VLOOKUP(E599,Treinamentos!$B$13:$G$42,6,0))","v":""}]
[null,null,{"$f":"IF(B600=\"\",\"\",VLOOKUP(B600,Colab!$C$14:$E$63,2,0))","v":""},{"$f":"IF(B600=\"\",\"\",VLOOKUP(B600,Colab!$C$14:$E$63,3,0))","v":""},null,{"$f":"IF(E600=\"\",\"\",VLOOKUP(E600,Treinamentos!$B$13:$G$42,5,0))","v":""},null,null,null,null,null,{"$f":"IF(E600=\"\",\"\",VLOOKUP(E600,Treinamentos!$B$13:$G$42,6,0))","v":""}]
[null,null,{"$f":"IF(B601=\"\",\"\",VLOOKUP(B601,Colab!$C$14:$E$63,2,0))","v":""},{"$f":"IF(B601=\"\",\"\",VLOOKUP(B601,Colab!$C$14:$E$63,3,0))","v":""},null,{"$f":"IF(E601=\"\",\"\",VLOOKUP(E601,Treinamentos!$B$13:$G$42,5,0))","v":""},null,null,null,null,null,{"$f":"IF(E601=\"\",\"\",VLOOKUP(E601,Treinamentos!$B$13:$G$42,6,0))","v":""}]
[null,null,{"$f":"IF(B602=\"\",\"\",VLOOKUP(B602,Colab!$C$14:$E$63,2,0))","v":""},{"$f":"IF(B602=\"\",\"\",VLOOKUP(B602,Colab!$C$14:$E$63,3,0))","v":""},null,{"$f":"IF(E602=\"\",\"\",VLOOKUP(E602,Treinamentos!$B$13:$G$42,5,0))","v":""},null,null,null,null,null,{"$f":"IF(E602=\"\",\"\",VLOOKUP(E602,Treinamentos!$B$13:$G$42,6,0))","v":""}]
[null,null,{"$f":"IF(B603=\"\",\"\",VLOOKUP(B603,Colab!$C$14:$E$63,2,0))","v":""},{"$f":"IF(B603=\"\",\"\",VLOOKUP(B603,Colab!$C$14:$E$63,3,0))","v":""},null,{"$f":"IF(E603=\"\",\"\",VLOOKUP(E603,Treinamentos!$B$13:$G$42,5,0))","v":""},null,null,null,null,null,{"$f":"IF(E603=\"\",\"\",VLOOKUP(E603,Treinamentos!$B$13:$G$42,6,0))","v":""}]
[null,null,{"$f":"IF(B604=\"\",\"\",VLOOKUP(B604,Colab!$C$14:$E$63,2,0))","v":""},{"$f":"IF(B604=\"\",\"\",VLOOKUP(B604,Colab!$C$14:$E$63,3,0))","v":""},null,{"$f":"IF(E604=\"\",\"\",VLOOKUP(E604,Treinamentos!$B$13:$G$42,5,0))","v":""},null,null,null,null,null,{"$f":"IF(E604=\"\",\"\",VLOOKUP(E604,Treinamentos!$B$13:$G$42,6,0))","v":""}]
[null,null,{"$f":"IF(B605=\"\",\"\",VLOOKUP(B605,Colab!$C$14:$E$63,2,0))","v":""},{"$f":"IF(B605=\"\",\"\",VLOOKUP(B605,Colab!$C$14:$E$63,3,0))","v":""},null,{"$f":"IF(E605=\"\",\"\",VLOOKUP(E605,Treinamentos!$B$13:$G$42,5,0))","v":""},null,null,null,null,null,{"$f":"IF(E605=\"\",\"\",VLOOKUP(E605,Treinamentos!$B$13:$G$42,6,0))","v":""}]
[null,null,{"$f":"IF(B606=\"\",\"\",VLOOKUP(B606,Colab!$C$14:$E$63,2,0))","v":""},{"$f":"IF(B606=\"\",\"\",VLOOKUP(B606,Colab!$C$14:$E$63,3,0))","v":""},null,{"$f":"IF(E606=\"\",\"\",VLOOKUP(E606,Treinamentos!$B$13:$G$42,5,0))","v":""},null,null,null,null,null,{"$f":"IF(E606=\"\",\"\",VLOOKUP(E606,Treinamentos!$B$13:$G$42,6,0))","v":""}]
[null,null,{"$f":"IF(B607=\"\",\"\",VLOOKUP(B607,Colab!$C$14:$E$63,2,0))","v":""},{"$f":"IF(B607=\"\",\"\",VLOOKUP(B607,Colab!$C$14:$E$63,3,0))","v":""},null,{"$f":"IF(E607=\"\",\"\",VLOOKUP(E607,Treinamentos!$B$13:$G$42,5,0))","v":""},null,null,null,null,null,{"$f":"IF(E607=\"\",\"\",VLOOKUP(E607,Treinamentos!$B$13:$G$42,6,0))","v":""}]
[null,null,{"$f":"IF(B608=\"\",\"\",VLOOKUP(B608,Colab!$C$14:$E$63,2,0))","v":""},{"$f":"IF(B608=\"\",\"\",VLOOKUP(B608,Colab!$C$14:$E$63,3,0))","v":""},null,{"$f":"IF(E608=\"\",\"\",VLOOKUP(E608,Treinamentos!$B$13:$G$42,5,0))","v":""},null,null,null,null,null,{"$f":"IF(E608=\"\",\"\",VLOOKUP(E608,Treinamentos!$B$13:$G$42,6,0))","v":""}]
[null,null,{"$f":"IF(B609=\"\",\"\",VLOOKUP(B609,Colab!$C$14:$E$63,2,0))","v":""},{"$f":"IF(B609=\"\",\"\",VLOOKUP(B609,Colab!$C$14:$E$63,3,0))","v":""},null,{"$f":"IF(E609=\"\",\"\",VLOOKUP(E609,Treinamentos!$B$13:$G$42,5,0))","v":""},null,null,null,null,null,{"$f":"IF(E609=\"\",\"\",VLOOKUP(E609,Treinamentos!$B$13:$G$42,6,0))","v":""}]
[null,null,{"$f":"IF(B610=\"\",\"\",VLOOKUP(B610,Colab!$C$14:$E$63,2,0))","v":""},{"$f":"IF(B610=\"\",\"\",VLOOKUP(B610,Colab!$C$14:$E$63,3,0))","v":""},null,{"$f":"IF(E610=\"\",\"\",VLOOKUP(E610,Treinamentos!$B$13:$G$42,5,0))","v":""},null,null,null,null,null,{"$f":"IF(E610=\"\",\"\",VLOOKUP(E610,Treinamentos!$B$13:$G$42,6,0))","v":""}]
[null,null,{"$f":"IF(B611=\"\",\"\",VLOOKUP(B611,Colab!$C$14:$E$63,2,0))","v":""},{"$f":"IF(B611=\"\",\"\",VLOOKUP(B611,Colab!$C$14:$E$63,3,0))","v":""},null,{"$f":"IF(E611=\"\",\"\",VLOOKUP(E611,Treinamentos!$B$13:$G$42,5,0))","v":""},null,null,null,null,null,{"$f":"IF(E611=\"\",\"\",VLOOKUP(E611,Treinamentos!$B$13:$G$42,6,0))","v":""}]
[null,null,{"$f":"IF(B612=\"\",\"\",VLOOKUP(B612,Colab!$C$14:$E$63,2,0))","v":""},{"$f":"IF(B612=\"\",\"\",VLOOKUP(B612,Colab!$C$14:$E$63,3,0))","v":""},null,{"$f":"IF(E612=\"\",\"\",VLOOKUP(E612,Treinamentos!$B$13:$G$42,5,0))","v":""},null,null,null,null,null,{"$f":"IF(E612=\"\",\"\",VLOOKUP(E612,Treinamentos!$B$13:$G$42,6,0))","v":""}]
[null,null,{"$f":"IF(B613=\"\",\"\",VLOOKUP(B613,Colab!$C$14:$E$63,2,0))","v":""},{"$f":"IF(B613=\"\",\"\",VLOOKUP(B613,Colab!$C$14:$E$63,3,0))","v":""},null,{"$f":"IF(E613=\"\",\"\",VLOOKUP(E613,Treinamentos!$B$13:$G$42,5,0))","v":""},null,null,null,null,null,{"$f":"IF(E613=\"\",\"\",VLOOKUP(E613,Treinamentos!$B$13:$G$42,6,0))","v":""}]
[null,null,{"$f":"IF(B614=\"\",\"\",VLOOKUP(B614,Colab!$C$14:$E$63,2,0))","v":""},{"$f":"IF(B614=\"\",\"\",VLOOKUP(B614,Colab!$C$14:$E$63,3,0))","v":""},null,{"$f":"IF(E614=\"\",\"\",VLOOKUP(E614,Treinamentos!$B$13:$G$42,5,0))","v":""},null,null,null,null,null,{"$f":"IF(E614=\"\",\"\",VLOOKUP(E614,Treinamentos!$B$13:$G$42,6,0))","v":""}]
[null,null,{"$f":"IF(B615=\"\",\"\",VLOOKUP(B615,Colab!$C$14:$E$63,2,0))","v":""},{"$f":"IF(B615=\"\",\"\",VLOOKUP(B615,Colab!$C$14:$E$63,3,0))","v":""},null,{"$f":"IF(E615=\"\",\"\",VLOOKUP(E615,Treinamentos!$B$13:$G$42,5,0))","v":""},null,null,null,null,null,{"$f":"IF(E615=\"\",\"\",VLOOKUP(E615,Treinamentos!$B$13:$G$42,6,0))","v":""}]
[null,null,{"$f":"IF(B616=\"\",\"\",VLOOKUP(B616,Colab!$C$14:$E$63,2,0))","v":""},{"$f":"IF(B616=\"\",\"\",VLOOKUP(B616,Colab!$C$14:$E$63,3,0))","v":""},null,{"$f":"IF(E616=\"\",\"\",VLOOKUP(E616,Treinamentos!$B$13:$G$42,5,0))","v":""},null,null,null,null,null,{"$f":"IF(E616=\"\",\"\",VLOOKUP(E616,Treinamentos!$B$13:$G$42,6,0))","v":""}]
[null,null,{"$f":"IF(B617=\"\",\"\",VLOOKUP(B617,Colab!$C$14:$E$63,2,0))","v":""},{"$f":"IF(B617=\"\",\"\",VLOOKUP(B617,Colab!$C$14:$E$63,3,0))","v":""},null,{"$f":"IF(E617=\"\",\"\",VLOOKUP(E617,Treinamentos!$B$13:$G$42,5,0))","v":""},null,null,null,null,null,{"$f":"IF(E617=\"\",\"\",VLOOKUP(E617,Treinamentos!$B$13:$G$42,6,0))","v":""}]
[null,null,{"$f":"IF(B618=\"\",\"\",VLOOKUP(B618,Colab!$C$14:$E$63,2,0))","v":""},{"$f":"IF(B618=\"\",\"\",VLOOKUP(B618,Colab!$C$14:$E$63,3,0))","v":""},null,{"$f":"IF(E618=\"\",\"\",VLOOKUP(E618,Treinamentos!$B$13:$G$42,5,0))","v":""},null,null,null,null,null,{"$f":"IF(E618=\"\",\"\",VLOOKUP(E618,Treinamentos!$B$13:$G$42,6,0))","v":""}]
[null,null,{"$f":"IF(B619=\"\",\"\",VLOOKUP(B619,Colab!$C$14:$E$63,2,0))","v":""},{"$f":"IF(B619=\"\",\"\",VLOOKUP(B619,Colab!$C$14:$E$63,3,0))","v":""},null,{"$f":"IF(E619=\"\",\"\",VLOOKUP(E619,Treinamentos!$B$13:$G$42,5,0))","v":""},null,null,null,null,null,{"$f":"IF(E619=\"\",\"\",VLOOKUP(E619,Treinamentos!$B$13:$G$42,6,0))","v":""}]
[null,null,{"$f":"IF(B620=\"\",\"\",VLOOKUP(B620,Colab!$C$14:$E$63,2,0))","v":""},{"$f":"IF(B620=\"\",\"\",VLOOKUP(B620,Colab!$C$14:$E$63,3,0))","v":""},null,{"$f":"IF(E620=\"\",\"\",VLOOKUP(E620,Treinamentos!$B$13:$G$42,5,0))","v":""},null,null,null,null,null,{"$f":"IF(E620=\"\",\"\",VLOOKUP(E620,Treinamentos!$B$13:$G$42,6,0))","v":""}]
[null,null,{"$f":"IF(B621=\"\",\"\",VLOOKUP(B621,Colab!$C$14:$E$63,2,0))","v":""},{"$f":"IF(B621=\"\",\"\",VLOOKUP(B621,Colab!$C$14:$E$63,3,0))","v":""},null,{"$f":"IF(E621=\"\",\"\",VLOOKUP(E621,Treinamentos!$B$13:$G$42,5,0))","v":""},null,null,null,null,null,{"$f":"IF(E621=\"\",\"\",VLOOKUP(E621,Treinamentos!$B$13:$G$42,6,0))","v":""}]
[null,null,{"$f":"IF(B622=\"\",\"\",VLOOKUP(B622,Colab!$C$14:$E$63,2,0))","v":""},{"$f":"IF(B622=\"\",\"\",VLOOKUP(B622,Colab!$C$14:$E$63,3,0))","v":""},null,{"$f":"IF(E622=\"\",\"\",VLOOKUP(E622,Treinamentos!$B$13:$G$42,5,0))","v":""},null,null,null,null,null,{"$f":"IF(E622=\"\",\"\",VLOOKUP(E622,Treinamentos!$B$13:$G$42,6,0))","v":""}]
[null,null,{"$f":"IF(B623=\"\",\"\",VLOOKUP(B623,Colab!$C$14:$E$63,2,0))","v":""},{"$f":"IF(B623=\"\",\"\",VLOOKUP(B623,Colab!$C$14:$E$63,3,0))","v":""},null,{"$f":"IF(E623=\"\",\"\",VLOOKUP(E623,Treinamentos!$B$13:$G$42,5,0))","v":""},null,null,null,null,null,{"$f":"IF(E623=\"\",\"\",VLOOKUP(E623,Treinamentos!$B$13:$G$42,6,0))","v":""}]
[null,null,{"$f":"IF(B624=\"\",\"\",VLOOKUP(B624,Colab!$C$14:$E$63,2,0))","v":""},{"$f":"IF(B624=\"\",\"\",VLOOKUP(B624,Colab!$C$14:$E$63,3,0))","v":""},null,{"$f":"IF(E624=\"\",\"\",VLOOKUP(E624,Treinamentos!$B$13:$G$42,5,0))","v":""},null,null,null,null,null,{"$f":"IF(E624=\"\",\"\",VLOOKUP(E624,Treinamentos!$B$13:$G$42,6,0))","v":""}]
[null,null,{"$f":"IF(B625=\"\",\"\",VLOOKUP(B625,Colab!$C$14:$E$63,2,0))","v":""},{"$f":"IF(B625=\"\",\"\",VLOOKUP(B625,Colab!$C$14:$E$63,3,0))","v":""},null,{"$f":"IF(E625=\"\",\"\",VLOOKUP(E625,Treinamentos!$B$13:$G$42,5,0))","v":""},null,null,null,null,null,{"$f":"IF(E625=\"\",\"\",VLOOKUP(E625,Treinamentos!$B$13:$G$42,6,0))","v":""}]
[null,null,{"$f":"IF(B626=\"\",\"\",VLOOKUP(B626,Colab!$C$14:$E$63,2,0))","v":""},{"$f":"IF(B626=\"\",\"\",VLOOKUP(B626,Colab!$C$14:$E$63,3,0))","v":""},null,{"$f":"IF(E626=\"\",\"\",VLOOKUP(E626,Treinamentos!$B$13:$G$42,5,0))","v":""},null,null,null,null,null,{"$f":"IF(E626=\"\",\"\",VLOOKUP(E626,Treinamentos!$B$13:$G$42,6,0))","v":""}]
[null,null,{"$f":"IF(B627=\"\",\"\",VLOOKUP(B627,Colab!$C$14:$E$63,2,0))","v":""},{"$f":"IF(B627=\"\",\"\",VLOOKUP(B627,Colab!$C$14:$E$63,3,0))","v":""},null,{"$f":"IF(E627=\"\",\"\",VLOOKUP(E627,Treinamentos!$B$13:$G$42,5,0))","v":""},null,null,null,null,null,{"$f":"IF(E627=\"\",\"\",VLOOKUP(E627,Treinamentos!$B$13:$G$42,6,0))","v":""}]
[null,null,{"$f":"IF(B628=\"\",\"\",VLOOKUP(B628,Colab!$C$14:$E$63,2,0))","v":""},{"$f":"IF(B628=\"\",\"\",VLOOKUP(B628,Colab!$C$14:$E$63,3,0))","v":""},null,{"$f":"IF(E628=\"\",\"\",VLOOKUP(E628,Treinamentos!$B$13:$G$42,5,0))","v":""},null,null,null,null,null,{"$f":"IF(E628=\"\",\"\",VLOOKUP(E628,Treinamentos!$B$13:$G$42,6,0))","v":""}]
[null,null,{"$f":"IF(B629=\"\",\"\",VLOOKUP(B629,Colab!$C$14:$E$63,2,0))","v":""},{"$f":"IF(B629=\"\",\"\",VLOOKUP(B629,Colab!$C$14:$E$63,3,0))","v":""},null,{"$f":"IF(E629=\"\",\"\",VLOOKUP(E629,Treinamentos!$B$13:$G$42,5,0))","v":""},null,null,null,null,null,{"$f":"IF(E629=\"\",\"\",VLOOKUP(E629,Treinamentos!$B$13:$G$42,6,0))","v":""}]
[null,null,{"$f":"IF(B630=\"\",\"\",VLOOKUP(B630,Colab!$C$14:$E$63,2,0))","v":""},{"$f":"IF(B630=\"\",\"\",VLOOKUP(B630,Colab!$C$14:$E$63,3,0))","v":""},null,{"$f":"IF(E630=\"\",\"\",VLOOKUP(E630,Treinamentos!$B$13:$G$42,5,0))","v":""},null,null,null,null,null,{"$f":"IF(E630=\"\",\"\",VLOOKUP(E630,Treinamentos!$B$13:$G$42,6,0))","v":""}]
[null,null,{"$f":"IF(B631=\"\",\"\",VLOOKUP(B631,Colab!$C$14:$E$63,2,0))","v":""},{"$f":"IF(B631=\"\",\"\",VLOOKUP(B631,Colab!$C$14:$E$63,3,0))","v":""},null,{"$f":"IF(E631=\"\",\"\",VLOOKUP(E631,Treinamentos!$B$13:$G$42,5,0))","v":""},null,null,null,null,null,{"$f":"IF(E631=\"\",\"\",VLOOKUP(E631,Treinamentos!$B$13:$G$42,6,0))","v":""}]
[null,null,{"$f":"IF(B632=\"\",\"\",VLOOKUP(B632,Colab!$C$14:$E$63,2,0))","v":""},{"$f":"IF(B632=\"\",\"\",VLOOKUP(B632,Colab!$C$14:$E$63,3,0))","v":""},null,{"$f":"IF(E632=\"\",\"\",VLOOKUP(E632,Treinamentos!$B$13:$G$42,5,0))","v":""},null,null,null,null,null,{"$f":"IF(E632=\"\",\"\",VLOOKUP(E632,Treinamentos!$B$13:$G$42,6,0))","v":""}]
[null,null,{"$f":"IF(B633=\"\",\"\",VLOOKUP(B633,Colab!$C$14:$E$63,2,0))","v":""},{"$f":"IF(B633=\"\",\"\",VLOOKUP(B633,Colab!$C$14:$E$63,3,0))","v":""},null,{"$f":"IF(E633=\"\",\"\",VLOOKUP(E633,Treinamentos!$B$13:$G$42,5,0))","v":""},null,null,null,null,null,{"$f":"IF(E633=\"\",\"\",VLOOKUP(E633,Treinamentos!$B$13:$G$42,6,0))","v":""}]
[null,null,{"$f":"IF(B634=\"\",\"\",VLOOKUP(B634,Colab!$C$14:$E$63,2,0))","v":""},{"$f":"IF(B634=\"\",\"\",VLOOKUP(B634,Colab!$C$14:$E$63,3,0))","v":""},null,{"$f":"IF(E634=\"\",\"\",VLOOKUP(E634,Treinamentos!$B$13:$G$42,5,0))","v":""},null,null,null,null,null,{"$f":"IF(E634=\"\",\"\",VLOOKUP(E634,Treinamentos!$B$13:$G$42,6,0))","v":""}]
[null,null,{"$f":"IF(B635=\"\",\"\",VLOOKUP(B635,Colab!$C$14:$E$63,2,0))","v":""},{"$f":"IF(B635=\"\",\"\",VLOOKUP(B635,Colab!$C$14:$E$63,3,0))","v":""},null,{"$f":"IF(E635=\"\",\"\",VLOOKUP(E635,Treinamentos!$B$13:$G$42,5,0))","v":""},null,null,null,null,null,{"$f":"IF(E635=\"\",\"\",VLOOKUP(E635,Treinamentos!$B$13:$G$42,6,0))","v":""}]
[null,null,{"$f":"IF(B636=\"\",\"\",VLOOKUP(B636,Colab!$C$14:$E$63,2,0))","v":""},{"$f":"IF(B636=\"\",\"\",VLOOKUP(B636,Colab!$C$14:$E$63,3,0))","v":""},null,{"$f":"IF(E636=\"\",\"\",VLOOKUP(E636,Treinamentos!$B$13:$G$42,5,0))","v":""},null,null,null,null,null,{"$f":"IF(E636=\"\",\"\",VLOOKUP(E636,Treinamentos!$B$13:$G$42,6,0))","v":""}]
[null,null,{"$f":"IF(B637=\"\",\"\",VLOOKUP(B637,Colab!$C$14:$E$63,2,0))","v":""},{"$f":"IF(B637=\"\",\"\",VLOOKUP(B637,Colab!$C$14:$E$63,3,0))","v":""},null,{"$f":"IF(E637=\"\",\"\",VLOOKUP(E637,Treinamentos!$B$13:$G$42,5,0))","v":""},null,null,null,null,null,{"$f":"IF(E637=\"\",\"\",VLOOKUP(E637,Treinamentos!$B$13:$G$42,6,0))","v":""}]
[null,null,{"$f":"IF(B638=\"\",\"\",VLOOKUP(B638,Colab!$C$14:$E$63,2,0))","v":""},{"$f":"IF(B638=\"\",\"\",VLOOKUP(B638,Colab!$C$14:$E$63,3,0))","v":""},null,{"$f":"IF(E638=\"\",\"\",VLOOKUP(E638,Treinamentos!$B$13:$G$42,5,0))","v":""},null,null,null,null,null,{"$f":"IF(E638=\"\",\"\",VLOOKUP(E638,Treinamentos!$B$13:$G$42,6,0))","v":""}]
[null,null,{"$f":"IF(B639=\"\",\"\",VLOOKUP(B639,Colab!$C$14:$E$63,2,0))","v":""},{"$f":"IF(B639=\"\",\"\",VLOOKUP(B639,Colab!$C$14:$E$63,3,0))","v":""},null,{"$f":"IF(E639=\"\",\"\",VLOOKUP(E639,Treinamentos!$B$13:$G$42,5,0))","v":""},null,null,null,null,null,{"$f":"IF(E639=\"\",\"\",VLOOKUP(E639,Treinamentos!$B$13:$G$42,6,0))","v":""}]
[null,null,{"$f":"IF(B640=\"\",\"\",VLOOKUP(B640,Colab!$C$14:$E$63,2,0))","v":""},{"$f":"IF(B640=\"\",\"\",VLOOKUP(B640,Colab!$C$14:$E$63,3,0))","v":""},null,{"$f":"IF(E640=\"\",\"\",VLOOKUP(E640,Treinamentos!$B$13:$G$42,5,0))","v":""},null,null,null,null,null,{"$f":"IF(E640=\"\",\"\",VLOOKUP(E640,Treinamentos!$B$13:$G$42,6,0))","v":""}]
[null,null,{"$f":"IF(B641=\"\",\"\",VLOOKUP(B641,Colab!$C$14:$E$63,2,0))","v":""},{"$f":"IF(B641=\"\",\"\",VLOOKUP(B641,Colab!$C$14:$E$63,3,0))","v":""},null,{"$f":"IF(E641=\"\",\"\",VLOOKUP(E641,Treinamentos!$B$13:$G$42,5,0))","v":""},null,null,null,null,null,{"$f":"IF(E641=\"\",\"\",VLOOKUP(E641,Treinamentos!$B$13:$G$42,6,0))","v":""}]
[null,null,{"$f":"IF(B642=\"\",\"\",VLOOKUP(B642,Colab!$C$14:$E$63,2,0))","v":""},{"$f":"IF(B642=\"\",\"\",VLOOKUP(B642,Colab!$C$14:$E$63,3,0))","v":""},null,{"$f":"IF(E642=\"\",\"\",VLOOKUP(E642,Treinamentos!$B$13:$G$42,5,0))","v":""},null,null,null,null,null,{"$f":"IF(E642=\"\",\"\",VLOOKUP(E642,Treinamentos!$B$13:$G$42,6,0))","v":""}]
[null,null,{"$f":"IF(B643=\"\",\"\",VLOOKUP(B643,Colab!$C$14:$E$63,2,0))","v":""},{"$f":"IF(B643=\"\",\"\",VLOOKUP(B643,Colab!$C$14:$E$63,3,0))","v":""},null,{"$f":"IF(E643=\"\",\"\",VLOOKUP(E643,Treinamentos!$B$13:$G$42,5,0))","v":""},null,null,null,null,null,{"$f":"IF(E643=\"\",\"\",VLOOKUP(E643,Treinamentos!$B$13:$G$42,6,0))","v":""}]
[null,null,{"$f":"IF(B644=\"\",\"\",VLOOKUP(B644,Colab!$C$14:$E$63,2,0))","v":""},{"$f":"IF(B644=\"\",\"\",VLOOKUP(B644,Colab!$C$14:$E$63,3,0))","v":""},null,{"$f":"IF(E644=\"\",\"\",VLOOKUP(E644,Treinamentos!$B$13:$G$42,5,0))","v":""},null,null,null,null,null,{"$f":"IF(E644=\"\",\"\",VLOOKUP(E644,Treinamentos!$B$13:$G$42,6,0))","v":""}]
[null,null,{"$f":"IF(B645=\"\",\"\",VLOOKUP(B645,Colab!$C$14:$E$63,2,0))","v":""},{"$f":"IF(B645=\"\",\"\",VLOOKUP(B645,Colab!$C$14:$E$63,3,0))","v":""},null,{"$f":"IF(E645=\"\",\"\",VLOOKUP(E645,Treinamentos!$B$13:$G$42,5,0))","v":""},null,null,null,null,null,{"$f":"IF(E645=\"\",\"\",VLOOKUP(E645,Treinamentos!$B$13:$G$42,6,0))","v":""}]
[null,null,{"$f":"IF(B646=\"\",\"\",VLOOKUP(B646,Colab!$C$14:$E$63,2,0))","v":""},{"$f":"IF(B646=\"\",\"\",VLOOKUP(B646,Colab!$C$14:$E$63,3,0))","v":""},null,{"$f":"IF(E646=\"\",\"\",VLOOKUP(E646,Treinamentos!$B$13:$G$42,5,0))","v":""},null,null,null,null,null,{"$f":"IF(E646=\"\",\"\",VLOOKUP(E646,Treinamentos!$B$13:$G$42,6,0))","v":""}]
[null,null,{"$f":"IF(B647=\"\",\"\",VLOOKUP(B647,Colab!$C$14:$E$63,2,0))","v":""},{"$f":"IF(B647=\"\",\"\",VLOOKUP(B647,Colab!$C$14:$E$63,3,0))","v":""},null,{"$f":"IF(E647=\"\",\"\",VLOOKUP(E647,Treinamentos!$B$13:$G$42,5,0))","v":""},null,null,null,null,null,{"$f":"IF(E647=\"\",\"\",VLOOKUP(E647,Treinamentos!$B$13:$G$42,6,0))","v":""}]
[null,null,{"$f":"IF(B648=\"\",\"\",VLOOKUP(B648,Colab!$C$14:$E$63,2,0))","v":""},{"$f":"IF(B648=\"\",\"\",VLOOKUP(B648,Colab!$C$14:$E$63,3,0))","v":""},null,{"$f":"IF(E648=\"\",\"\",VLOOKUP(E648,Treinamentos!$B$13:$G$42,5,0))","v":""},null,null,null,null,null,{"$f":"IF(E648=\"\",\"\",VLOOKUP(E648,Treinamentos!$B$13:$G$42,6,0))","v":""}]
[null,null,{"$f":"IF(B649=\"\",\"\",VLOOKUP(B649,Colab!$C$14:$E$63,2,0))","v":""},{"$f":"IF(B649=\"\",\"\",VLOOKUP(B649,Colab!$C$14:$E$63,3,0))","v":""},null,{"$f":"IF(E649=\"\",\"\",VLOOKUP(E649,Treinamentos!$B$13:$G$42,5,0))","v":""},null,null,null,null,null,{"$f":"IF(E649=\"\",\"\",VLOOKUP(E649,Treinamentos!$B$13:$G$42,6,0))","v":""}]
[null,null,{"$f":"IF(B650=\"\",\"\",VLOOKUP(B650,Colab!$C$14:$E$63,2,0))","v":""},{"$f":"IF(B650=\"\",\"\",VLOOKUP(B650,Colab!$C$14:$E$63,3,0))","v":""},null,{"$f":"IF(E650=\"\",\"\",VLOOKUP(E650,Treinamentos!$B$13:$G$42,5,0))","v":""},null,null,null,null,null,{"$f":"IF(E650=\"\",\"\",VLOOKUP(E650,Treinamentos!$B$13:$G$42,6,0))","v":""}]
[null,null,{"$f":"IF(B651=\"\",\"\",VLOOKUP(B651,Colab!$C$14:$E$63,2,0))","v":""},{"$f":"IF(B651=\"\",\"\",VLOOKUP(B651,Colab!$C$14:$E$63,3,0))","v":""},null,{"$f":"IF(E651=\"\",\"\",VLOOKUP(E651,Treinamentos!$B$13:$G$42,5,0))","v":""},null,null,null,null,null,{"$f":"IF(E651=\"\",\"\",VLOOKUP(E651,Treinamentos!$B$13:$G$42,6,0))","v":""}]
[null,null,{"$f":"IF(B652=\"\",\"\",VLOOKUP(B652,Colab!$C$14:$E$63,2,0))","v":""},{"$f":"IF(B652=\"\",\"\",VLOOKUP(B652,Colab!$C$14:$E$63,3,0))","v":""},null,{"$f":"IF(E652=\"\",\"\",VLOOKUP(E652,Treinamentos!$B$13:$G$42,5,0))","v":""},null,null,null,null,null,{"$f":"IF(E652=\"\",\"\",VLOOKUP(E652,Treinamentos!$B$13:$G$42,6,0))","v":""}]
[null,null,{"$f":"IF(B653=\"\",\"\",VLOOKUP(B653,Colab!$C$14:$E$63,2,0))","v":""},{"$f":"IF(B653=\"\",\"\",VLOOKUP(B653,Colab!$C$14:$E$63,3,0))","v":""},null,{"$f":"IF(E653=\"\",\"\",VLOOKUP(E653,Treinamentos!$B$13:$G$42,5,0))","v":""},null,null,null,null,null,{"$f":"IF(E653=\"\",\"\",VLOOKUP(E653,Treinamentos!$B$13:$G$42,6,0))","v":""}]
[null,null,{"$f":"IF(B654=\"\",\"\",VLOOKUP(B654,Colab!$C$14:$E$63,2,0))","v":""},{"$f":"IF(B654=\"\",\"\",VLOOKUP(B654,Colab!$C$14:$E$63,3,0))","v":""},null,{"$f":"IF(E654=\"\",\"\",VLOOKUP(E654,Treinamentos!$B$13:$G$42,5,0))","v":""},null,null,null,null,null,{"$f":"IF(E654=\"\",\"\",VLOOKUP(E654,Treinamentos!$B$13:$G$42,6,0))","v":""}]
[null,null,{"$f":"IF(B655=\"\",\"\",VLOOKUP(B655,Colab!$C$14:$E$63,2,0))","v":""},{"$f":"IF(B655=\"\",\"\",VLOOKUP(B655,Colab!$C$14:$E$63,3,0))","v":""},null,{"$f":"IF(E655=\"\",\"\",VLOOKUP(E655,Treinamentos!$B$13:$G$42,5,0))","v":""},null,null,null,null,null,{"$f":"IF(E655=\"\",\"\",VLOOKUP(E655,Treinamentos!$B$13:$G$42,6,0))","v":""}]
[null,null,{"$f":"IF(B656=\"\",\"\",VLOOKUP(B656,Colab!$C$14:$E$63,2,0))","v":""},{"$f":"IF(B656=\"\",\"\",VLOOKUP(B656,Colab!$C$14:$E$63,3,0))","v":""},null,{"$f":"IF(E656=\"\",\"\",VLOOKUP(E656,Treinamentos!$B$13:$G$42,5,0))","v":""},null,null,null,null,null,{"$f":"IF(E656=\"\",\"\",VLOOKUP(E656,Treinamentos!$B$13:$G$42,6,0))","v":""}]
[null,null,{"$f":"IF(B657=\"\",\"\",VLOOKUP(B657,Colab!$C$14:$E$63,2,0))","v":""},{"$f":"IF(B657=\"\",\"\",VLOOKUP(B657,Colab!$C$14:$E$63,3,0))","v":""},null,{"$f":"IF(E657=\"\",\"\",VLOOKUP(E657,Treinamentos!$B$13:$G$42,5,0))","v":""},null,null,null,null,null,{"$f":"IF(E657=\"\",\"\",VLOOKUP(E657,Treinamentos!$B$13:$G$42,6,0))","v":""}]
[null,null,{"$f":"IF(B658=\"\",\"\",VLOOKUP(B658,Colab!$C$14:$E$63,2,0))","v":""},{"$f":"IF(B658=\"\",\"\",VLOOKUP(B658,Colab!$C$14:$E$63,3,0))","v":""},null,{"$f":"IF(E658=\"\",\"\",VLOOKUP(E658,Treinamentos!$B$13:$G$42,5,0))","v":""},null,null,null,null,null,{"$f":"IF(E658=\"\",\"\",VLOOKUP(E658,Treinamentos!$B$13:$G$42,6,0))","v":""}]
[null,null,{"$f":"IF(B659=\"\",\"\",VLOOKUP(B659,Colab!$C$14:$E$63,2,0))","v":""},{"$f":"IF(B659=\"\",\"\",VLOOKUP(B659,Colab!$C$14:$E$63,3,0))","v":""},null,{"$f":"IF(E659=\"\",\"\",VLOOKUP(E659,Treinamentos!$B$13:$G$42,5,0))","v":""},null,null,null,null,null,{"$f":"IF(E659=\"\",\"\",VLOOKUP(E659,Treinamentos!$B$13:$G$42,6,0))","v":""}]
[null,null,{"$f":"IF(B660=\"\",\"\",VLOOKUP(B660,Colab!$C$14:$E$63,2,0))","v":""},{"$f":"IF(B660=\"\",\"\",VLOOKUP(B660,Colab!$C$14:$E$63,3,0))","v":""},null,{"$f":"IF(E660=\"\",\"\",VLOOKUP(E660,Treinamentos!$B$13:$G$42,5,0))","v":""},null,null,null,null,null,{"$f":"IF(E660=\"\",\"\",VLOOKUP(E660,Treinamentos!$B$13:$G$42,6,0))","v":""}]
[null,null,{"$f":"IF(B661=\"\",\"\",VLOOKUP(B661,Colab!$C$14:$E$63,2,0))","v":""},{"$f":"IF(B661=\"\",\"\",VLOOKUP(B661,Colab!$C$14:$E$63,3,0))","v":""},null,{"$f":"IF(E661=\"\",\"\",VLOOKUP(E661,Treinamentos!$B$13:$G$42,5,0))","v":""},null,null,null,null,null,{"$f":"IF(E661=\"\",\"\",VLOOKUP(E661,Treinamentos!$B$13:$G$42,6,0))","v":""}]
[null,null,{"$f":"IF(B662=\"\",\"\",VLOOKUP(B662,Colab!$C$14:$E$63,2,0))","v":""},{"$f":"IF(B662=\"\",\"\",VLOOKUP(B662,Colab!$C$14:$E$63,3,0))","v":""},null,{"$f":"IF(E662=\"\",\"\",VLOOKUP(E662,Treinamentos!$B$13:$G$42,5,0))","v":""},null,null,null,null,null,{"$f":"IF(E662=\"\",\"\",VLOOKUP(E662,Treinamentos!$B$13:$G$42,6,0))","v":""}]
[null,null,{"$f":"IF(B663=\"\",\"\",VLOOKUP(B663,Colab!$C$14:$E$63,2,0))","v":""},{"$f":"IF(B663=\"\",\"\",VLOOKUP(B663,Colab!$C$14:$E$63,3,0))","v":""},null,{"$f":"IF(E663=\"\",\"\",VLOOKUP(E663,Treinamentos!$B$13:$G$42,5,0))","v":""},null,null,null,null,null,{"$f":"IF(E663=\"\",\"\",VLOOKUP(E663,Treinamentos!$B$13:$G$42,6,0))","v":""}]
[null,null,{"$f":"IF(B664=\"\",\"\",VLOOKUP(B664,Colab!$C$14:$E$63,2,0))","v":""},{"$f":"IF(B664=\"\",\"\",VLOOKUP(B664,Colab!$C$14:$E$63,3,0))","v":""},null,{"$f":"IF(E664=\"\",\"\",VLOOKUP(E664,Treinamentos!$B$13:$G$42,5,0))","v":""},null,null,null,null,null,{"$f":"IF(E664=\"\",\"\",VLOOKUP(E664,Treinamentos!$B$13:$G$42,6,0))","v":""}]
[null,null,{"$f":"IF(B665=\"\",\"\",VLOOKUP(B665,Colab!$C$14:$E$63,2,0))","v":""},{"$f":"IF(B665=\"\",\"\",VLOOKUP(B665,Colab!$C$14:$E$63,3,0))","v":""},null,{"$f":"IF(E665=\"\",\"\",VLOOKUP(E665,Treinamentos!$B$13:$G$42,5,0))","v":""},null,null,null,null,null,{"$f":"IF(E665=\"\",\"\",VLOOKUP(E665,Treinamentos!$B$13:$G$42,6,0))","v":""}]
[null,null,{"$f":"IF(B666=\"\",\"\",VLOOKUP(B666,Colab!$C$14:$E$63,2,0))","v":""},{"$f":"IF(B666=\"\",\"\",VLOOKUP(B666,Colab!$C$14:$E$63,3,0))","v":""},null,{"$f":"IF(E666=\"\",\"\",VLOOKUP(E666,Treinamentos!$B$13:$G$42,5,0))","v":""},null,null,null,null,null,{"$f":"IF(E666=\"\",\"\",VLOOKUP(E666,Treinamentos!$B$13:$G$42,6,0))","v":""}]
[null,null,{"$f":"IF(B667=\"\",\"\",VLOOKUP(B667,Colab!$C$14:$E$63,2,0))","v":""},{"$f":"IF(B667=\"\",\"\",VLOOKUP(B667,Colab!$C$14:$E$63,3,0))","v":""},null,{"$f":"IF(E667=\"\",\"\",VLOOKUP(E667,Treinamentos!$B$13:$G$42,5,0))","v":""},null,null,null,null,null,{"$f":"IF(E667=\"\",\"\",VLOOKUP(E667,Treinamentos!$B$13:$G$42,6,0))","v":""}]
[null,null,{"$f":"IF(B668=\"\",\"\",VLOOKUP(B668,Colab!$C$14:$E$63,2,0))","v":""},{"$f":"IF(B668=\"\",\"\",VLOOKUP(B668,Colab!$C$14:$E$63,3,0))","v":""},null,{"$f":"IF(E668=\"\",\"\",VLOOKUP(E668,Treinamentos!$B$13:$G$42,5,0))","v":""},null,null,null,null,null,{"$f":"IF(E668=\"\",\"\",VLOOKUP(E668,Treinamentos!$B$13:$G$42,6,0))","v":""}]
[null,null,{"$f":"IF(B669=\"\",\"\",VLOOKUP(B669,Colab!$C$14:$E$63,2,0))","v":""},{"$f":"IF(B669=\"\",\"\",VLOOKUP(B669,Colab!$C$14:$E$63,3,0))","v":""},null,{"$f":"IF(E669=\"\",\"\",VLOOKUP(E669,Treinamentos!$B$13:$G$42,5,0))","v":""},null,null,null,null,null,{"$f":"IF(E669=\"\",\"\",VLOOKUP(E669,Treinamentos!$B$13:$G$42,6,0))","v":""}]
[null,null,{"$f":"IF(B670=\"\",\"\",VLOOKUP(B670,Colab!$C$14:$E$63,2,0))","v":""},{"$f":"IF(B670=\"\",\"\",VLOOKUP(B670,Colab!$C$14:$E$63,3,0))","v":""},null,{"$f":"IF(E670=\"\",\"\",VLOOKUP(E670,Treinamentos!$B$13:$G$42,5,0))","v":""},null,null,null,null,null,{"$f":"IF(E670=\"\",\"\",VLOOKUP(E670,Treinamentos!$B$13:$G$42,6,0))","v":""}]
[null,null,{"$f":"IF(B671=\"\",\"\",VLOOKUP(B671,Colab!$C$14:$E$63,2,0))","v":""},{"$f":"IF(B671=\"\",\"\",VLOOKUP(B671,Colab!$C$14:$E$63,3,0))","v":""},null,{"$f":"IF(E671=\"\",\"\",VLOOKUP(E671,Treinamentos!$B$13:$G$42,5,0))","v":""},null,null,null,null,null,{"$f":"IF(E671=\"\",\"\",VLOOKUP(E671,Treinamentos!$B$13:$G$42,6,0))","v":""}]
[null,null,{"$f":"IF(B672=\"\",\"\",VLOOKUP(B672,Colab!$C$14:$E$63,2,0))","v":""},{"$f":"IF(B672=\"\",\"\",VLOOKUP(B672,Colab!$C$14:$E$63,3,0))","v":""},null,{"$f":"IF(E672=\"\",\"\",VLOOKUP(E672,Treinamentos!$B$13:$G$42,5,0))","v":""},null,null,null,null,null,{"$f":"IF(E672=\"\",\"\",VLOOKUP(E672,Treinamentos!$B$13:$G$42,6,0))","v":""}]
[null,null,{"$f":"IF(B673=\"\",\"\",VLOOKUP(B673,Colab!$C$14:$E$63,2,0))","v":""},{"$f":"IF(B673=\"\",\"\",VLOOKUP(B673,Colab!$C$14:$E$63,3,0))","v":""},null,{"$f":"IF(E673=\"\",\"\",VLOOKUP(E673,Treinamentos!$B$13:$G$42,5,0))","v":""},null,null,null,null,null,{"$f":"IF(E673=\"\",\"\",VLOOKUP(E673,Treinamentos!$B$13:$G$42,6,0))","v":""}]
[null,null,{"$f":"IF(B674=\"\",\"\",VLOOKUP(B674,Colab!$C$14:$E$63,2,0))","v":""},{"$f":"IF(B674=\"\",\"\",VLOOKUP(B674,Colab!$C$14:$E$63,3,0))","v":""},null,{"$f":"IF(E674=\"\",\"\",VLOOKUP(E674,Treinamentos!$B$13:$G$42,5,0))","v":""},null,null,null,null,null,{"$f":"IF(E674=\"\",\"\",VLOOKUP(E674,Treinamentos!$B$13:$G$42,6,0))","v":""}]
[null,null,{"$f":"IF(B675=\"\",\"\",VLOOKUP(B675,Colab!$C$14:$E$63,2,0))","v":""},{"$f":"IF(B675=\"\",\"\",VLOOKUP(B675,Colab!$C$14:$E$63,3,0))","v":""},null,{"$f":"IF(E675=\"\",\"\",VLOOKUP(E675,Treinamentos!$B$13:$G$42,5,0))","v":""},null,null,null,null,null,{"$f":"IF(E675=\"\",\"\",VLOOKUP(E675,Treinamentos!$B$13:$G$42,6,0))","v":""}]
[null,null,{"$f":"IF(B676=\"\",\"\",VLOOKUP(B676,Colab!$C$14:$E$63,2,0))","v":""},{"$f":"IF(B676=\"\",\"\",VLOOKUP(B676,Colab!$C$14:$E$63,3,0))","v":""},null,{"$f":"IF(E676=\"\",\"\",VLOOKUP(E676,Treinamentos!$B$13:$G$42,5,0))","v":""},null,null,null,null,null,{"$f":"IF(E676=\"\",\"\",VLOOKUP(E676,Treinamentos!$B$13:$G$42,6,0))","v":""}]
[null,null,{"$f":"IF(B677=\"\",\"\",VLOOKUP(B677,Colab!$C$14:$E$63,2,0))","v":""},{"$f":"IF(B677=\"\",\"\",VLOOKUP(B677,Colab!$C$14:$E$63,3,0))","v":""},null,{"$f":"IF(E677=\"\",\"\",VLOOKUP(E677,Treinamentos!$B$13:$G$42,5,0))","v":""},null,null,null,null,null,{"$f":"IF(E677=\"\",\"\",VLOOKUP(E677,Treinamentos!$B$13:$G$42,6,0))","v":""}]
[null,null,{"$f":"IF(B678=\"\",\"\",VLOOKUP(B678,Colab!$C$14:$E$63,2,0))","v":""},{"$f":"IF(B678=\"\",\"\",VLOOKUP(B678,Colab!$C$14:$E$63,3,0))","v":""},null,{"$f":"IF(E678=\"\",\"\",VLOOKUP(E678,Treinamentos!$B$13:$G$42,5,0))","v":""},null,null,null,null,null,{"$f":"IF(E678=\"\",\"\",VLOOKUP(E678,Treinamentos!$B$13:$G$42,6,0))","v":""}]
[null,null,{"$f":"IF(B679=\"\",\"\",VLOOKUP(B679,Colab!$C$14:$E$63,2,0))","v":""},{"$f":"IF(B679=\"\",\"\",VLOOKUP(B679,Colab!$C$14:$E$63,3,0))","v":""},null,{"$f":"IF(E679=\"\",\"\",VLOOKUP(E679,Treinamentos!$B$13:$G$42,5,0))","v":""},null,null,null,null,null,{"$f":"IF(E679=\"\",\"\",VLOOKUP(E679,Treinamentos!$B$13:$G$42,6,0))","v":""}]
[null,null,{"$f":"IF(B680=\"\",\"\",VLOOKUP(B680,Colab!$C$14:$E$63,2,0))","v":""},{"$f":"IF(B680=\"\",\"\",VLOOKUP(B680,Colab!$C$14:$E$63,3,0))","v":""},null,{"$f":"IF(E680=\"\",\"\",VLOOKUP(E680,Treinamentos!$B$13:$G$42,5,0))","v":""},null,null,null,null,null,{"$f":"IF(E680=\"\",\"\",VLOOKUP(E680,Treinamentos!$B$13:$G$42,6,0))","v":""}]
[null,null,{"$f":"IF(B681=\"\",\"\",VLOOKUP(B681,Colab!$C$14:$E$63,2,0))","v":""},{"$f":"IF(B681=\"\",\"\",VLOOKUP(B681,Colab!$C$14:$E$63,3,0))","v":""},null,{"$f":"IF(E681=\"\",\"\",VLOOKUP(E681,Treinamentos!$B$13:$G$42,5,0))","v":""},null,null,null,null,null,{"$f":"IF(E681=\"\",\"\",VLOOKUP(E681,Treinamentos!$B$13:$G$42,6,0))","v":""}]
[null,null,{"$f":"IF(B682=\"\",\"\",VLOOKUP(B682,Colab!$C$14:$E$63,2,0))","v":""},{"$f":"IF(B682=\"\",\"\",VLOOKUP(B682,Colab!$C$14:$E$63,3,0))","v":""},null,{"$f":"IF(E682=\"\",\"\",VLOOKUP(E682,Treinamentos!$B$13:$G$42,5,0))","v":""},null,null,null,null,null,{"$f":"IF(E682=\"\",\"\",VLOOKUP(E682,Treinamentos!$B$13:$G$42,6,0))","v":""}]
[null,null,{"$f":"IF(B683=\"\",\"\",VLOOKUP(B683,Colab!$C$14:$E$63,2,0))","v":""},{"$f":"IF(B683=\"\",\"\",VLOOKUP(B683,Colab!$C$14:$E$63,3,0))","v":""},null,{"$f":"IF(E683=\"\",\"\",VLOOKUP(E683,Treinamentos!$B$13:$G$42,5,0))","v":""},null,null,null,null,null,{"$f":"IF(E683=\"\",\"\",VLOOKUP(E683,Treinamentos!$B$13:$G$42,6,0))","v":""}]
[null,null,{"$f":"IF(B684=\"\",\"\",VLOOKUP(B684,Colab!$C$14:$E$63,2,0))","v":""},{"$f":"IF(B684=\"\",\"\",VLOOKUP(B684,Colab!$C$14:$E$63,3,0))","v":""},null,{"$f":"IF(E684=\"\",\"\",VLOOKUP(E684,Treinamentos!$B$13:$G$42,5,0))","v":""},null,null,null,null,null,{"$f":"IF(E684=\"\",\"\",VLOOKUP(E684,Treinamentos!$B$13:$G$42,6,0))","v":""}]
[null,null,{"$f":"IF(B685=\"\",\"\",VLOOKUP(B685,Colab!$C$14:$E$63,2,0))","v":""},{"$f":"IF(B685=\"\",\"\",VLOOKUP(B685,Colab!$C$14:$E$63,3,0))","v":""},null,{"$f":"IF(E685=\"\",\"\",VLOOKUP(E685,Treinamentos!$B$13:$G$42,5,0))","v":""},null,null,null,null,null,{"$f":"IF(E685=\"\",\"\",VLOOKUP(E685,Treinamentos!$B$13:$G$42,6,0))","v":""}]
[null,null,{"$f":"IF(B686=\"\",\"\",VLOOKUP(B686,Colab!$C$14:$E$63,2,0))","v":""},{"$f":"IF(B686=\"\",\"\",VLOOKUP(B686,Colab!$C$14:$E$63,3,0))","v":""},null,{"$f":"IF(E686=\"\",\"\",VLOOKUP(E686,Treinamentos!$B$13:$G$42,5,0))","v":""},null,null,null,null,null,{"$f":"IF(E686=\"\",\"\",VLOOKUP(E686,Treinamentos!$B$13:$G$42,6,0))","v":""}]
[null,null,{"$f":"IF(B687=\"\",\"\",VLOOKUP(B687,Colab!$C$14:$E$63,2,0))","v":""},{"$f":"IF(B687=\"\",\"\",VLOOKUP(B687,Colab!$C$14:$E$63,3,0))","v":""},null,{"$f":"IF(E687=\"\",\"\",VLOOKUP(E687,Treinamentos!$B$13:$G$42,5,0))","v":""},null,null,null,null,null,{"$f":"IF(E687=\"\",\"\",VLOOKUP(E687,Treinamentos!$B$13:$G$42,6,0))","v":""}]
[null,null,{"$f":"IF(B688=\"\",\"\",VLOOKUP(B688,Colab!$C$14:$E$63,2,0))","v":""},{"$f":"IF(B688=\"\",\"\",VLOOKUP(B688,Colab!$C$14:$E$63,3,0))","v":""},null,{"$f":"IF(E688=\"\",\"\",VLOOKUP(E688,Treinamentos!$B$13:$G$42,5,0))","v":""},null,null,null,null,null,{"$f":"IF(E688=\"\",\"\",VLOOKUP(E688,Treinamentos!$B$13:$G$42,6,0))","v":""}]
[null,null,{"$f":"IF(B689=\"\",\"\",VLOOKUP(B689,Colab!$C$14:$E$63,2,0))","v":""},{"$f":"IF(B689=\"\",\"\",VLOOKUP(B689,Colab!$C$14:$E$63,3,0))","v":""},null,{"$f":"IF(E689=\"\",\"\",VLOOKUP(E689,Treinamentos!$B$13:$G$42,5,0))","v":""},null,null,null,null,null,{"$f":"IF(E689=\"\",\"\",VLOOKUP(E689,Treinamentos!$B$13:$G$42,6,0))","v":""}]
[null,null,{"$f":"IF(B690=\"\",\"\",VLOOKUP(B690,Colab!$C$14:$E$63,2,0))","v":""},{"$f":"IF(B690=\"\",\"\",VLOOKUP(B690,Colab!$C$14:$E$63,3,0))","v":""},null,{"$f":"IF(E690=\"\",\"\",VLOOKUP(E690,Treinamentos!$B$13:$G$42,5,0))","v":""},null,null,null,null,null,{"$f":"IF(E690=\"\",\"\",VLOOKUP(E690,Treinamentos!$B$13:$G$42,6,0))","v":""}]
[null,null,{"$f":"IF(B691=\"\",\"\",VLOOKUP(B691,Colab!$C$14:$E$63,2,0))","v":""},{"$f":"IF(B691=\"\",\"\",VLOOKUP(B691,Colab!$C$14:$E$63,3,0))","v":""},null,{"$f":"IF(E691=\"\",\"\",VLOOKUP(E691,Treinamentos!$B$13:$G$42,5,0))","v":""},null,null,null,null,null,{"$f":"IF(E691=\"\",\"\",VLOOKUP(E691,Treinamentos!$B$13:$G$42,6,0))","v":""}]
[null,null,{"$f":"IF(B692=\"\",\"\",VLOOKUP(B692,Colab!$C$14:$E$63,2,0))","v":""},{"$f":"IF(B692=\"\",\"\",VLOOKUP(B692,Colab!$C$14:$E$63,3,0))","v":""},null,{"$f":"IF(E692=\"\",\"\",VLOOKUP(E692,Treinamentos!$B$13:$G$42,5,0))","v":""},null,null,null,null,null,{"$f":"IF(E692=\"\",\"\",VLOOKUP(E692,Treinamentos!$B$13:$G$42,6,0))","v":""}]
[null,null,{"$f":"IF(B693=\"\",\"\",VLOOKUP(B693,Colab!$C$14:$E$63,2,0))","v":""},{"$f":"IF(B693=\"\",\"\",VLOOKUP(B693,Colab!$C$14:$E$63,3,0))","v":""},null,{"$f":"IF(E693=\"\",\"\",VLOOKUP(E693,Treinamentos!$B$13:$G$42,5,0))","v":""},null,null,null,null,null,{"$f":"IF(E693=\"\",\"\",VLOOKUP(E693,Treinamentos!$B$13:$G$42,6,0))","v":""}]
[null,null,{"$f":"IF(B694=\"\",\"\",VLOOKUP(B694,Colab!$C$14:$E$63,2,0))","v":""},{"$f":"IF(B694=\"\",\"\",VLOOKUP(B694,Colab!$C$14:$E$63,3,0))","v":""},null,{"$f":"IF(E694=\"\",\"\",VLOOKUP(E694,Treinamentos!$B$13:$G$42,5,0))","v":""},null,null,null,null,null,{"$f":"IF(E694=\"\",\"\",VLOOKUP(E694,Treinamentos!$B$13:$G$42,6,0))","v":""}]
[null,null,{"$f":"IF(B695=\"\",\"\",VLOOKUP(B695,Colab!$C$14:$E$63,2,0))","v":""},{"$f":"IF(B695=\"\",\"\",VLOOKUP(B695,Colab!$C$14:$E$63,3,0))","v":""},null,{"$f":"IF(E695=\"\",\"\",VLOOKUP(E695,Treinamentos!$B$13:$G$42,5,0))","v":""},null,null,null,null,null,{"$f":"IF(E695=\"\",\"\",VLOOKUP(E695,Treinamentos!$B$13:$G$42,6,0))","v":""}]
[null,null,{"$f":"IF(B696=\"\",\"\",VLOOKUP(B696,Colab!$C$14:$E$63,2,0))","v":""},{"$f":"IF(B696=\"\",\"\",VLOOKUP(B696,Colab!$C$14:$E$63,3,0))","v":""},null,{"$f":"IF(E696=\"\",\"\",VLOOKUP(E696,Treinamentos!$B$13:$G$42,5,0))","v":""},null,null,null,null,null,{"$f":"IF(E696=\"\",\"\",VLOOKUP(E696,Treinamentos!$B$13:$G$42,6,0))","v":""}]
[null,null,{"$f":"IF(B697=\"\",\"\",VLOOKUP(B697,Colab!$C$14:$E$63,2,0))","v":""},{"$f":"IF(B697=\"\",\"\",VLOOKUP(B697,Colab!$C$14:$E$63,3,0))","v":""},null,{"$f":"IF(E697=\"\",\"\",VLOOKUP(E697,Treinamentos!$B$13:$G$42,5,0))","v":""},null,null,null,null,null,{"$f":"IF(E697=\"\",\"\",VLOOKUP(E697,Treinamentos!$B$13:$G$42,6,0))","v":""}]
[null,null,{"$f":"IF(B698=\"\",\"\",VLOOKUP(B698,Colab!$C$14:$E$63,2,0))","v":""},{"$f":"IF(B698=\"\",\"\",VLOOKUP(B698,Colab!$C$14:$E$63,3,0))","v":""},null,{"$f":"IF(E698=\"\",\"\",VLOOKUP(E698,Treinamentos!$B$13:$G$42,5,0))","v":""},null,null,null,null,null,{"$f":"IF(E698=\"\",\"\",VLOOKUP(E698,Treinamentos!$B$13:$G$42,6,0))","v":""}]
[null,null,{"$f":"IF(B699=\"\",\"\",VLOOKUP(B699,Colab!$C$14:$E$63,2,0))","v":""},{"$f":"IF(B699=\"\",\"\",VLOOKUP(B699,Colab!$C$14:$E$63,3,0))","v":""},null,{"$f":"IF(E699=\"\",\"\",VLOOKUP(E699,Treinamentos!$B$13:$G$42,5,0))","v":""},null,null,null,null,null,{"$f":"IF(E699=\"\",\"\",VLOOKUP(E699,Treinamentos!$B$13:$G$42,6,0))","v":""}]
[null,null,{"$f":"IF(B700=\"\",\"\",VLOOKUP(B700,Colab!$C$14:$E$63,2,0))","v":""},{"$f":"IF(B700=\"\",\"\",VLOOKUP(B700,Colab!$C$14:$E$63,3,0))","v":""},null,{"$f":"IF(E700=\"\",\"\",VLOOKUP(E700,Treinamentos!$B$13:$G$42,5,0))","v":""},null,null,null,null,null,{"$f":"IF(E700=\"\",\"\",VLOOKUP(E700,Treinamentos!$B$13:$G$42,6,0))","v":""}]
[null,null,{"$f":"IF(B701=\"\",\"\",VLOOKUP(B701,Colab!$C$14:$E$63,2,0))","v":""},{"$f":"IF(B701=\"\",\"\",VLOOKUP(B701,Colab!$C$14:$E$63,3,0))","v":""},null,{"$f":"IF(E701=\"\",\"\",VLOOKUP(E701,Treinamentos!$B$13:$G$42,5,0))","v":""},null,null,null,null,null,{"$f":"IF(E701=\"\",\"\",VLOOKUP(E701,Treinamentos!$B$13:$G$42,6,0))","v":""}]
[null,null,{"$f":"IF(B702=\"\",\"\",VLOOKUP(B702,Colab!$C$14:$E$63,2,0))","v":""},{"$f":"IF(B702=\"\",\"\",VLOOKUP(B702,Colab!$C$14:$E$63,3,0))","v":""},null,{"$f":"IF(E702=\"\",\"\",VLOOKUP(E702,Treinamentos!$B$13:$G$42,5,0))","v":""},null,null,null,null,null,{"$f":"IF(E702=\"\",\"\",VLOOKUP(E702,Treinamentos!$B$13:$G$42,6,0))","v":""}]
[null,null,{"$f":"IF(B703=\"\",\"\",VLOOKUP(B703,Colab!$C$14:$E$63,2,0))","v":""},{"$f":"IF(B703=\"\",\"\",VLOOKUP(B703,Colab!$C$14:$E$63,3,0))","v":""},null,{"$f":"IF(E703=\"\",\"\",VLOOKUP(E703,Treinamentos!$B$13:$G$42,5,0))","v":""},null,null,null,null,null,{"$f":"IF(E703=\"\",\"\",VLOOKUP(E703,Treinamentos!$B$13:$G$42,6,0))","v":""}]
[null,null,{"$f":"IF(B704=\"\",\"\",VLOOKUP(B704,Colab!$C$14:$E$63,2,0))","v":""},{"$f":"IF(B704=\"\",\"\",VLOOKUP(B704,Colab!$C$14:$E$63,3,0))","v":""},null,{"$f":"IF(E704=\"\",\"\",VLOOKUP(E704,Treinamentos!$B$13:$G$42,5,0))","v":""},null,null,null,null,null,{"$f":"IF(E704=\"\",\"\",VLOOKUP(E704,Treinamentos!$B$13:$G$42,6,0))","v":""}]
[null,null,{"$f":"IF(B705=\"\",\"\",VLOOKUP(B705,Colab!$C$14:$E$63,2,0))","v":""},{"$f":"IF(B705=\"\",\"\",VLOOKUP(B705,Colab!$C$14:$E$63,3,0))","v":""},null,{"$f":"IF(E705=\"\",\"\",VLOOKUP(E705,Treinamentos!$B$13:$G$42,5,0))","v":""},null,null,null,null,null,{"$f":"IF(E705=\"\",\"\",VLOOKUP(E705,Treinamentos!$B$13:$G$42,6,0))","v":""}]
[null,null,{"$f":"IF(B706=\"\",\"\",VLOOKUP(B706,Colab!$C$14:$E$63,2,0))","v":""},{"$f":"IF(B706=\"\",\"\",VLOOKUP(B706,Colab!$C$14:$E$63,3,0))","v":""},null,{"$f":"IF(E706=\"\",\"\",VLOOKUP(E706,Treinamentos!$B$13:$G$42,5,0))","v":""},null,null,null,null,null,{"$f":"IF(E706=\"\",\"\",VLOOKUP(E706,Treinamentos!$B$13:$G$42,6,0))","v":""}]
[null,null,{"$f":"IF(B707=\"\",\"\",VLOOKUP(B707,Colab!$C$14:$E$63,2,0))","v":""},{"$f":"IF(B707=\"\",\"\",VLOOKUP(B707,Colab!$C$14:$E$63,3,0))","v":""},null,{"$f":"IF(E707=\"\",\"\",VLOOKUP(E707,Treinamentos!$B$13:$G$42,5,0))","v":""},null,null,null,null,null,{"$f":"IF(E707=\"\",\"\",VLOOKUP(E707,Treinamentos!$B$13:$G$42,6,0))","v":""}]
[null,null,{"$f":"IF(B708=\"\",\"\",VLOOKUP(B708,Colab!$C$14:$E$63,2,0))","v":""},{"$f":"IF(B708=\"\",\"\",VLOOKUP(B708,Colab!$C$14:$E$63,3,0))","v":""},null,{"$f":"IF(E708=\"\",\"\",VLOOKUP(E708,Treinamentos!$B$13:$G$42,5,0))","v":""},null,null,null,null,null,{"$f":"IF(E708=\"\",\"\",VLOOKUP(E708,Treinamentos!$B$13:$G$42,6,0))","v":""}]
[null,null,{"$f":"IF(B709=\"\",\"\",VLOOKUP(B709,Colab!$C$14:$E$63,2,0))","v":""},{"$f":"IF(B709=\"\",\"\",VLOOKUP(B709,Colab!$C$14:$E$63,3,0))","v":""},null,{"$f":"IF(E709=\"\",\"\",VLOOKUP(E709,Treinamentos!$B$13:$G$42,5,0))","v":""},null,null,null,null,null,{"$f":"IF(E709=\"\",\"\",VLOOKUP(E709,Treinamentos!$B$13:$G$42,6,0))","v":""}]
[null,null,{"$f":"IF(B710=\"\",\"\",VLOOKUP(B710,Colab!$C$14:$E$63,2,0))","v":""},{"$f":"IF(B710=\"\",\"\",VLOOKUP(B710,Colab!$C$14:$E$63,3,0))","v":""},null,{"$f":"IF(E710=\"\",\"\",VLOOKUP(E710,Treinamentos!$B$13:$G$42,5,0))","v":""},null,null,null,null,null,{"$f":"IF(E710=\"\",\"\",VLOOKUP(E710,Treinamentos!$B$13:$G$42,6,0))","v":""}]
[null,null,{"$f":"IF(B711=\"\",\"\",VLOOKUP(B711,Colab!$C$14:$E$63,2,0))","v":""},{"$f":"IF(B711=\"\",\"\",VLOOKUP(B711,Colab!$C$14:$E$63,3,0))","v":""},null,{"$f":"IF(E711=\"\",\"\",VLOOKUP(E711,Treinamentos!$B$13:$G$42,5,0))","v":""},null,null,null,null,null,{"$f":"IF(E711=\"\",\"\",VLOOKUP(E711,Treinamentos!$B$13:$G$42,6,0))","v":""}]
[null,null,{"$f":"IF(B712=\"\",\"\",VLOOKUP(B712,Colab!$C$14:$E$63,2,0))","v":""},{"$f":"IF(B712=\"\",\"\",VLOOKUP(B712,Colab!$C$14:$E$63,3,0))","v":""},null,{"$f":"IF(E712=\"\",\"\",VLOOKUP(E712,Treinamentos!$B$13:$G$42,5,0))","v":""},null,null,null,null,null,{"$f":"IF(E712=\"\",\"\",VLOOKUP(E712,Treinamentos!$B$13:$G$42,6,0))","v":""}]
[null,null,{"$f":"IF(B713=\"\",\"\",VLOOKUP(B713,Colab!$C$14:$E$63,2,0))","v":""},{"$f":"IF(B713=\"\",\"\",VLOOKUP(B713,Colab!$C$14:$E$63,3,0))","v":""},null,{"$f":"IF(E713=\"\",\"\",VLOOKUP(E713,Treinamentos!$B$13:$G$42,5,0))","v":""},null,null,null,null,null,{"$f":"IF(E713=\"\",\"\",VLOOKUP(E713,Treinamentos!$B$13:$G$42,6,0))","v":""}]
[null,null,{"$f":"IF(B714=\"\",\"\",VLOOKUP(B714,Colab!$C$14:$E$63,2,0))","v":""},{"$f":"IF(B714=\"\",\"\",VLOOKUP(B714,Colab!$C$14:$E$63,3,0))","v":""},null,{"$f":"IF(E714=\"\",\"\",VLOOKUP(E714,Treinamentos!$B$13:$G$42,5,0))","v":""},null,null,null,null,null,{"$f":"IF(E714=\"\",\"\",VLOOKUP(E714,Treinamentos!$B$13:$G$42,6,0))","v":""}]
[null,null,{"$f":"IF(B715=\"\",\"\",VLOOKUP(B715,Colab!$C$14:$E$63,2,0))","v":""},{"$f":"IF(B715=\"\",\"\",VLOOKUP(B715,Colab!$C$14:$E$63,3,0))","v":""},null,{"$f":"IF(E715=\"\",\"\",VLOOKUP(E715,Treinamentos!$B$13:$G$42,5,0))","v":""},null,null,null,null,null,{"$f":"IF(E715=\"\",\"\",VLOOKUP(E715,Treinamentos!$B$13:$G$42,6,0))","v":""}]
[null,null,{"$f":"IF(B716=\"\",\"\",VLOOKUP(B716,Colab!$C$14:$E$63,2,0))","v":""},{"$f":"IF(B716=\"\",\"\",VLOOKUP(B716,Colab!$C$14:$E$63,3,0))","v":""},null,{"$f":"IF(E716=\"\",\"\",VLOOKUP(E716,Treinamentos!$B$13:$G$42,5,0))","v":""},null,null,null,null,null,{"$f":"IF(E716=\"\",\"\",VLOOKUP(E716,Treinamentos!$B$13:$G$42,6,0))","v":""}]
[null,null,{"$f":"IF(B717=\"\",\"\",VLOOKUP(B717,Colab!$C$14:$E$63,2,0))","v":""},{"$f":"IF(B717=\"\",\"\",VLOOKUP(B717,Colab!$C$14:$E$63,3,0))","v":""},null,{"$f":"IF(E717=\"\",\"\",VLOOKUP(E717,Treinamentos!$B$13:$G$42,5,0))","v":""},null,null,null,null,null,{"$f":"IF(E717=\"\",\"\",VLOOKUP(E717,Treinamentos!$B$13:$G$42,6,0))","v":""}]
[null,null,{"$f":"IF(B718=\"\",\"\",VLOOKUP(B718,Colab!$C$14:$E$63,2,0))","v":""},{"$f":"IF(B718=\"\",\"\",VLOOKUP(B718,Colab!$C$14:$E$63,3,0))","v":""},null,{"$f":"IF(E718=\"\",\"\",VLOOKUP(E718,Treinamentos!$B$13:$G$42,5,0))","v":""},null,null,null,null,null,{"$f":"IF(E718=\"\",\"\",VLOOKUP(E718,Treinamentos!$B$13:$G$42,6,0))","v":""}]
[null,null,{"$f":"IF(B719=\"\",\"\",VLOOKUP(B719,Colab!$C$14:$E$63,2,0))","v":""},{"$f":"IF(B719=\"\",\"\",VLOOKUP(B719,Colab!$C$14:$E$63,3,0))","v":""},null,{"$f":"IF(E719=\"\",\"\",VLOOKUP(E719,Treinamentos!$B$13:$G$42,5,0))","v":""},null,null,null,null,null,{"$f":"IF(E719=\"\",\"\",VLOOKUP(E719,Treinamentos!$B$13:$G$42,6,0))","v":""}]
[null,null,{"$f":"IF(B720=\"\",\"\",VLOOKUP(B720,Colab!$C$14:$E$63,2,0))","v":""},{"$f":"IF(B720=\"\",\"\",VLOOKUP(B720,Colab!$C$14:$E$63,3,0))","v":""},null,{"$f":"IF(E720=\"\",\"\",VLOOKUP(E720,Treinamentos!$B$13:$G$42,5,0))","v":""},null,null,null,null,null,{"$f":"IF(E720=\"\",\"\",VLOOKUP(E720,Treinamentos!$B$13:$G$42,6,0))","v":""}]
[null,null,{"$f":"IF(B721=\"\",\"\",VLOOKUP(B721,Colab!$C$14:$E$63,2,0))","v":""},{"$f":"IF(B721=\"\",\"\",VLOOKUP(B721,Colab!$C$14:$E$63,3,0))","v":""},null,{"$f":"IF(E721=\"\",\"\",VLOOKUP(E721,Treinamentos!$B$13:$G$42,5,0))","v":""},null,null,null,null,null,{"$f":"IF(E721=\"\",\"\",VLOOKUP(E721,Treinamentos!$B$13:$G$42,6,0))","v":""}]
[null,null,{"$f":"IF(B722=\"\",\"\",VLOOKUP(B722,Colab!$C$14:$E$63,2,0))","v":""},{"$f":"IF(B722=\"\",\"\",VLOOKUP(B722,Colab!$C$14:$E$63,3,0))","v":""},null,{"$f":"IF(E722=\"\",\"\",VLOOKUP(E722,Treinamentos!$B$13:$G$42,5,0))","v":""},null,null,null,null,null,{"$f":"IF(E722=\"\",\"\",VLOOKUP(E722,Treinamentos!$B$13:$G$42,6,0))","v":""}]
[null,null,{"$f":"IF(B723=\"\",\"\",VLOOKUP(B723,Colab!$C$14:$E$63,2,0))","v":""},{"$f":"IF(B723=\"\",\"\",VLOOKUP(B723,Colab!$C$14:$E$63,3,0))","v":""},null,{"$f":"IF(E723=\"\",\"\",VLOOKUP(E723,Treinamentos!$B$13:$G$42,5,0))","v":""},null,null,null,null,null,{"$f":"IF(E723=\"\",\"\",VLOOKUP(E723,Treinamentos!$B$13:$G$42,6,0))","v":""}]
[null,null,{"$f":"IF(B724=\"\",\"\",VLOOKUP(B724,Colab!$C$14:$E$63,2,0))","v":""},{"$f":"IF(B724=\"\",\"\",VLOOKUP(B724,Colab!$C$14:$E$63,3,0))","v":""},null,{"$f":"IF(E724=\"\",\"\",VLOOKUP(E724,Treinamentos!$B$13:$G$42,5,0))","v":""},null,null,null,null,null,{"$f":"IF(E724=\"\",\"\",VLOOKUP(E724,Treinamentos!$B$13:$G$42,6,0))","v":""}]
[null,null,{"$f":"IF(B725=\"\",\"\",VLOOKUP(B725,Colab!$C$14:$E$63,2,0))","v":""},{"$f":"IF(B725=\"\",\"\",VLOOKUP(B725,Colab!$C$14:$E$63,3,0))","v":""},null,{"$f":"IF(E725=\"\",\"\",VLOOKUP(E725,Treinamentos!$B$13:$G$42,5,0))","v":""},null,null,null,null,null,{"$f":"IF(E725=\"\",\"\",VLOOKUP(E725,Treinamentos!$B$13:$G$42,6,0))","v":""}]
[null,null,{"$f":"IF(B726=\"\",\"\",VLOOKUP(B726,Colab!$C$14:$E$63,2,0))","v":""},{"$f":"IF(B726=\"\",\"\",VLOOKUP(B726,Colab!$C$14:$E$63,3,0))","v":""},null,{"$f":"IF(E726=\"\",\"\",VLOOKUP(E726,Treinamentos!$B$13:$G$42,5,0))","v":""},null,null,null,null,null,{"$f":"IF(E726=\"\",\"\",VLOOKUP(E726,Treinamentos!$B$13:$G$42,6,0))","v":""}]
[null,null,{"$f":"IF(B727=\"\",\"\",VLOOKUP(B727,Colab!$C$14:$E$63,2,0))","v":""},{"$f":"IF(B727=\"\",\"\",VLOOKUP(B727,Colab!$C$14:$E$63,3,0))","v":""},null,{"$f":"IF(E727=\"\",\"\",VLOOKUP(E727,Treinamentos!$B$13:$G$42,5,0))","v":""},null,null,null,null,null,{"$f":"IF(E727=\"\",\"\",VLOOKUP(E727,Treinamentos!$B$13:$G$42,6,0))","v":""}]
[null,null,{"$f":"IF(B728=\"\",\"\",VLOOKUP(B728,Colab!$C$14:$E$63,2,0))","v":""},{"$f":"IF(B728=\"\",\"\",VLOOKUP(B728,Colab!$C$14:$E$63,3,0))","v":""},null,{"$f":"IF(E728=\"\",\"\",VLOOKUP(E728,Treinamentos!$B$13:$G$42,5,0))","v":""},null,null,null,null,null,{"$f":"IF(E728=\"\",\"\",VLOOKUP(E728,Treinamentos!$B$13:$G$42,6,0))","v":""}]
[null,null,{"$f":"IF(B729=\"\",\"\",VLOOKUP(B729,Colab!$C$14:$E$63,2,0))","v":""},{"$f":"IF(B729=\"\",\"\",VLOOKUP(B729,Colab!$C$14:$E$63,3,0))","v":""},null,{"$f":"IF(E729=\"\",\"\",VLOOKUP(E729,Treinamentos!$B$13:$G$42,5,0))","v":""},null,null,null,null,null,{"$f":"IF(E729=\"\",\"\",VLOOKUP(E729,Treinamentos!$B$13:$G$42,6,0))","v":""}]
[null,null,{"$f":"IF(B730=\"\",\"\",VLOOKUP(B730,Colab!$C$14:$E$63,2,0))","v":""},{"$f":"IF(B730=\"\",\"\",VLOOKUP(B730,Colab!$C$14:$E$63,3,0))","v":""},null,{"$f":"IF(E730=\"\",\"\",VLOOKUP(E730,Treinamentos!$B$13:$G$42,5,0))","v":""},null,null,null,null,null,{"$f":"IF(E730=\"\",\"\",VLOOKUP(E730,Treinamentos!$B$13:$G$42,6,0))","v":""}]
[null,null,{"$f":"IF(B731=\"\",\"\",VLOOKUP(B731,Colab!$C$14:$E$63,2,0))","v":""},{"$f":"IF(B731=\"\",\"\",VLOOKUP(B731,Colab!$C$14:$E$63,3,0))","v":""},null,{"$f":"IF(E731=\"\",\"\",VLOOKUP(E731,Treinamentos!$B$13:$G$42,5,0))","v":""},null,null,null,null,null,{"$f":"IF(E731=\"\",\"\",VLOOKUP(E731,Treinamentos!$B$13:$G$42,6,0))","v":""}]
[null,null,{"$f":"IF(B732=\"\",\"\",VLOOKUP(B732,Colab!$C$14:$E$63,2,0))","v":""},{"$f":"IF(B732=\"\",\"\",VLOOKUP(B732,Colab!$C$14:$E$63,3,0))","v":""},null,{"$f":"IF(E732=\"\",\"\",VLOOKUP(E732,Treinamentos!$B$13:$G$42,5,0))","v":""},null,null,null,null,null,{"$f":"IF(E732=\"\",\"\",VLOOKUP(E732,Treinamentos!$B$13:$G$42,6,0))","v":""}]
[null,null,{"$f":"IF(B733=\"\",\"\",VLOOKUP(B733,Colab!$C$14:$E$63,2,0))","v":""},{"$f":"IF(B733=\"\",\"\",VLOOKUP(B733,Colab!$C$14:$E$63,3,0))","v":""},null,{"$f":"IF(E733=\"\",\"\",VLOOKUP(E733,Treinamentos!$B$13:$G$42,5,0))","v":""},null,null,null,null,null,{"$f":"IF(E733=\"\",\"\",VLOOKUP(E733,Treinamentos!$B$13:$G$42,6,0))","v":""}]
[null,null,{"$f":"IF(B734=\"\",\"\",VLOOKUP(B734,Colab!$C$14:$E$63,2,0))","v":""},{"$f":"IF(B734=\"\",\"\",VLOOKUP(B734,Colab!$C$14:$E$63,3,0))","v":""},null,{"$f":"IF(E734=\"\",\"\",VLOOKUP(E734,Treinamentos!$B$13:$G$42,5,0))","v":""},null,null,null,null,null,{"$f":"IF(E734=\"\",\"\",VLOOKUP(E734,Treinamentos!$B$13:$G$42,6,0))","v":""}]
[null,null,{"$f":"IF(B735=\"\",\"\",VLOOKUP(B735,Colab!$C$14:$E$63,2,0))","v":""},{"$f":"IF(B735=\"\",\"\",VLOOKUP(B735,Colab!$C$14:$E$63,3,0))","v":""},null,{"$f":"IF(E735=\"\",\"\",VLOOKUP(E735,Treinamentos!$B$13:$G$42,5,0))","v":""},null,null,null,null,null,{"$f":"IF(E735=\"\",\"\",VLOOKUP(E735,Treinamentos!$B$13:$G$42,6,0))","v":""}]
[null,null,{"$f":"IF(B736=\"\",\"\",VLOOKUP(B736,Colab!$C$14:$E$63,2,0))","v":""},{"$f":"IF(B736=\"\",\"\",VLOOKUP(B736,Colab!$C$14:$E$63,3,0))","v":""},null,{"$f":"IF(E736=\"\",\"\",VLOOKUP(E736,Treinamentos!$B$13:$G$42,5,0))","v":""},null,null,null,null,null,{"$f":"IF(E736=\"\",\"\",VLOOKUP(E736,Treinamentos!$B$13:$G$42,6,0))","v":""}]
[null,null,{"$f":"IF(B737=\"\",\"\",VLOOKUP(B737,Colab!$C$14:$E$63,2,0))","v":""},{"$f":"IF(B737=\"\",\"\",VLOOKUP(B737,Colab!$C$14:$E$63,3,0))","v":""},null,{"$f":"IF(E737=\"\",\"\",VLOOKUP(E737,Treinamentos!$B$13:$G$42,5,0))","v":""},null,null,null,null,null,{"$f":"IF(E737=\"\",\"\",VLOOKUP(E737,Treinamentos!$B$13:$G$42,6,0))","v":""}]
[null,null,{"$f":"IF(B738=\"\",\"\",VLOOKUP(B738,Colab!$C$14:$E$63,2,0))","v":""},{"$f":"IF(B738=\"\",\"\",VLOOKUP(B738,Colab!$C$14:$E$63,3,0))","v":""},null,{"$f":"IF(E738=\"\",\"\",VLOOKUP(E738,Treinamentos!$B$13:$G$42,5,0))","v":""},null,null,null,null,null,{"$f":"IF(E738=\"\",\"\",VLOOKUP(E738,Treinamentos!$B$13:$G$42,6,0))","v":""}]
[null,null,{"$f":"IF(B739=\"\",\"\",VLOOKUP(B739,Colab!$C$14:$E$63,2,0))","v":""},{"$f":"IF(B739=\"\",\"\",VLOOKUP(B739,Colab!$C$14:$E$63,3,0))","v":""},null,{"$f":"IF(E739=\"\",\"\",VLOOKUP(E739,Treinamentos!$B$13:$G$42,5,0))","v":""},null,null,null,null,null,{"$f":"IF(E739=\"\",\"\",VLOOKUP(E739,Treinamentos!$B$13:$G$42,6,0))","v":""}]
[null,null,{"$f":"IF(B740=\"\",\"\",VLOOKUP(B740,Colab!$C$14:$E$63,2,0))","v":""},{"$f":"IF(B740=\"\",\"\",VLOOKUP(B740,Colab!$C$14:$E$63,3,0))","v":""},null,{"$f":"IF(E740=\"\",\"\",VLOOKUP(E740,Treinamentos!$B$13:$G$42,5,0))","v":""},null,null,null,null,null,{"$f":"IF(E740=\"\",\"\",VLOOKUP(E740,Treinamentos!$B$13:$G$42,6,0))","v":""}]
[null,null,{"$f":"IF(B741=\"\",\"\",VLOOKUP(B741,Colab!$C$14:$E$63,2,0))","v":""},{"$f":"IF(B741=\"\",\"\",VLOOKUP(B741,Colab!$C$14:$E$63,3,0))","v":""},null,{"$f":"IF(E741=\"\",\"\",VLOOKUP(E741,Treinamentos!$B$13:$G$42,5,0))","v":""},null,null,null,null,null,{"$f":"IF(E741=\"\",\"\",VLOOKUP(E741,Treinamentos!$B$13:$G$42,6,0))","v":""}]
[null,null,{"$f":"IF(B742=\"\",\"\",VLOOKUP(B742,Colab!$C$14:$E$63,2,0))","v":""},{"$f":"IF(B742=\"\",\"\",VLOOKUP(B742,Colab!$C$14:$E$63,3,0))","v":""},null,{"$f":"IF(E742=\"\",\"\",VLOOKUP(E742,Treinamentos!$B$13:$G$42,5,0))","v":""},null,null,null,null,null,{"$f":"IF(E742=\"\",\"\",VLOOKUP(E742,Treinamentos!$B$13:$G$42,6,0))","v":""}]
[null,null,{"$f":"IF(B743=\"\",\"\",VLOOKUP(B743,Colab!$C$14:$E$63,2,0))","v":""},{"$f":"IF(B743=\"\",\"\",VLOOKUP(B743,Colab!$C$14:$E$63,3,0))","v":""},null,{"$f":"IF(E743=\"\",\"\",VLOOKUP(E743,Treinamentos!$B$13:$G$42,5,0))","v":""},null,null,null,null,null,{"$f":"IF(E743=\"\",\"\",VLOOKUP(E743,Treinamentos!$B$13:$G$42,6,0))","v":""}]
[null,null,{"$f":"IF(B744=\"\",\"\",VLOOKUP(B744,Colab!$C$14:$E$63,2,0))","v":""},{"$f":"IF(B744=\"\",\"\",VLOOKUP(B744,Colab!$C$14:$E$63,3,0))","v":""},null,{"$f":"IF(E744=\"\",\"\",VLOOKUP(E744,Treinamentos!$B$13:$G$42,5,0))","v":""},null,null,null,null,null,{"$f":"IF(E744=\"\",\"\",VLOOKUP(E744,Treinamentos!$B$13:$G$42,6,0))","v":""}]
[null,null,{"$f":"IF(B745=\"\",\"\",VLOOKUP(B745,Colab!$C$14:$E$63,2,0))","v":""},{"$f":"IF(B745=\"\",\"\",VLOOKUP(B745,Colab!$C$14:$E$63,3,0))","v":""},null,{"$f":"IF(E745=\"\",\"\",VLOOKUP(E745,Treinamentos!$B$13:$G$42,5,0))","v":""},null,null,null,null,null,{"$f":"IF(E745=\"\",\"\",VLOOKUP(E745,Treinamentos!$B$13:$G$42,6,0))","v":""}]
[null,null,{"$f":"IF(B746=\"\",\"\",VLOOKUP(B746,Colab!$C$14:$E$63,2,0))","v":""},{"$f":"IF(B746=\"\",\"\",VLOOKUP(B746,Colab!$C$14:$E$63,3,0))","v":""},null,{"$f":"IF(E746=\"\",\"\",VLOOKUP(E746,Treinamentos!$B$13:$G$42,5,0))","v":""},null,null,null,null,null,{"$f":"IF(E746=\"\",\"\",VLOOKUP(E746,Treinamentos!$B$13:$G$42,6,0))","v":""}]
[null,null,{"$f":"IF(B747=\"\",\"\",VLOOKUP(B747,Colab!$C$14:$E$63,2,0))","v":""},{"$f":"IF(B747=\"\",\"\",VLOOKUP(B747,Colab!$C$14:$E$63,3,0))","v":""},null,{"$f":"IF(E747=\"\",\"\",VLOOKUP(E747,Treinamentos!$B$13:$G$42,5,0))","v":""},null,null,null,null,null,{"$f":"IF(E747=\"\",\"\",VLOOKUP(E747,Treinamentos!$B$13:$G$42,6,0))","v":""}]
[null,null,{"$f":"IF(B748=\"\",\"\",VLOOKUP(B748,Colab!$C$14:$E$63,2,0))","v":""},{"$f":"IF(B748=\"\",\"\",VLOOKUP(B748,Colab!$C$14:$E$63,3,0))","v":""},null,{"$f":"IF(E748=\"\",\"\",VLOOKUP(E748,Treinamentos!$B$13:$G$42,5,0))","v":""},null,null,null,null,null,{"$f":"IF(E748=\"\",\"\",VLOOKUP(E748,Treinamentos!$B$13:$G$42,6,0))","v":""}]
[null,null,{"$f":"IF(B749=\"\",\"\",VLOOKUP(B749,Colab!$C$14:$E$63,2,0))","v":""},{"$f":"IF(B749=\"\",\"\",VLOOKUP(B749,Colab!$C$14:$E$63,3,0))","v":""},null,{"$f":"IF(E749=\"\",\"\",VLOOKUP(E749,Treinamentos!$B$13:$G$42,5,0))","v":""},null,null,null,null,null,{"$f":"IF(E749=\"\",\"\",VLOOKUP(E749,Treinamentos!$B$13:$G$42,6,0))","v":""}]
[null,null,{"$f":"IF(B750=\"\",\"\",VLOOKUP(B750,Colab!$C$14:$E$63,2,0))","v":""},{"$f":"IF(B750=\"\",\"\",VLOOKUP(B750,Colab!$C$14:$E$63,3,0))","v":""},null,{"$f":"IF(E750=\"\",\"\",VLOOKUP(E750,Treinamentos!$B$13:$G$42,5,0))","v":""},null,null,null,null,null,{"$f":"IF(E750=\"\",\"\",VLOOKUP(E750,Treinamentos!$B$13:$G$42,6,0))","v":""}]
[null,null,{"$f":"IF(B751=\"\",\"\",VLOOKUP(B751,Colab!$C$14:$E$63,2,0))","v":""},{"$f":"IF(B751=\"\",\"\",VLOOKUP(B751,Colab!$C$14:$E$63,3,0))","v":""},null,{"$f":"IF(E751=\"\",\"\",VLOOKUP(E751,Treinamentos!$B$13:$G$42,5,0))","v":""},null,null,null,null,null,{"$f":"IF(E751=\"\",\"\",VLOOKUP(E751,Treinamentos!$B$13:$G$42,6,0))","v":""}]
[null,null,{"$f":"IF(B752=\"\",\"\",VLOOKUP(B752,Colab!$C$14:$E$63,2,0))","v":""},{"$f":"IF(B752=\"\",\"\",VLOOKUP(B752,Colab!$C$14:$E$63,3,0))","v":""},null,{"$f":"IF(E752=\"\",\"\",VLOOKUP(E752,Treinamentos!$B$13:$G$42,5,0))","v":""},null,null,null,null,null,{"$f":"IF(E752=\"\",\"\",VLOOKUP(E752,Treinamentos!$B$13:$G$42,6,0))","v":""}]
[null,null,{"$f":"IF(B753=\"\",\"\",VLOOKUP(B753,Colab!$C$14:$E$63,2,0))","v":""},{"$f":"IF(B753=\"\",\"\",VLOOKUP(B753,Colab!$C$14:$E$63,3,0))","v":""},null,{"$f":"IF(E753=\"\",\"\",VLOOKUP(E753,Treinamentos!$B$13:$G$42,5,0))","v":""},null,null,null,null,null,{"$f":"IF(E753=\"\",\"\",VLOOKUP(E753,Treinamentos!$B$13:$G$42,6,0))","v":""}]
[null,null,{"$f":"IF(B754=\"\",\"\",VLOOKUP(B754,Colab!$C$14:$E$63,2,0))","v":""},{"$f":"IF(B754=\"\",\"\",VLOOKUP(B754,Colab!$C$14:$E$63,3,0))","v":""},null,{"$f":"IF(E754=\"\",\"\",VLOOKUP(E754,Treinamentos!$B$13:$G$42,5,0))","v":""},null,null,null,null,null,{"$f":"IF(E754=\"\",\"\",VLOOKUP(E754,Treinamentos!$B$13:$G$42,6,0))","v":""}]
[null,null,{"$f":"IF(B755=\"\",\"\",VLOOKUP(B755,Colab!$C$14:$E$63,2,0))","v":""},{"$f":"IF(B755=\"\",\"\",VLOOKUP(B755,Colab!$C$14:$E$63,3,0))","v":""},null,{"$f":"IF(E755=\"\",\"\",VLOOKUP(E755,Treinamentos!$B$13:$G$42,5,0))","v":""},null,null,null,null,null,{"$f":"IF(E755=\"\",\"\",VLOOKUP(E755,Treinamentos!$B$13:$G$42,6,0))","v":""}]
[null,null,{"$f":"IF(B756=\"\",\"\",VLOOKUP(B756,Colab!$C$14:$E$63,2,0))","v":""},{"$f":"IF(B756=\"\",\"\",VLOOKUP(B756,Colab!$C$14:$E$63,3,0))","v":""},null,{"$f":"IF(E756=\"\",\"\",VLOOKUP(E756,Treinamentos!$B$13:$G$42,5,0))","v":""},null,null,null,null,null,{"$f":"IF(E756=\"\",\"\",VLOOKUP(E756,Treinamentos!$B$13:$G$42,6,0))","v":""}]
[null,null,{"$f":"IF(B757=\"\",\"\",VLOOKUP(B757,Colab!$C$14:$E$63,2,0))","v":""},{"$f":"IF(B757=\"\",\"\",VLOOKUP(B757,Colab!$C$14:$E$63,3,0))","v":""},null,{"$f":"IF(E757=\"\",\"\",VLOOKUP(E757,Treinamentos!$B$13:$G$42,5,0))","v":""},null,null,null,null,null,{"$f":"IF(E757=\"\",\"\",VLOOKUP(E757,Treinamentos!$B$13:$G$42,6,0))","v":""}]
[null,null,{"$f":"IF(B758=\"\",\"\",VLOOKUP(B758,Colab!$C$14:$E$63,2,0))","v":""},{"$f":"IF(B758=\"\",\"\",VLOOKUP(B758,Colab!$C$14:$E$63,3,0))","v":""},null,{"$f":"IF(E758=\"\",\"\",VLOOKUP(E758,Treinamentos!$B$13:$G$42,5,0))","v":""},null,null,null,null,null,{"$f":"IF(E758=\"\",\"\",VLOOKUP(E758,Treinamentos!$B$13:$G$42,6,0))","v":""}]
[null,null,{"$f":"IF(B759=\"\",\"\",VLOOKUP(B759,Colab!$C$14:$E$63,2,0))","v":""},{"$f":"IF(B759=\"\",\"\",VLOOKUP(B759,Colab!$C$14:$E$63,3,0))","v":""},null,{"$f":"IF(E759=\"\",\"\",VLOOKUP(E759,Treinamentos!$B$13:$G$42,5,0))","v":""},null,null,null,null,null,{"$f":"IF(E759=\"\",\"\",VLOOKUP(E759,Treinamentos!$B$13:$G$42,6,0))","v":""}]
[null,null,{"$f":"IF(B760=\"\",\"\",VLOOKUP(B760,Colab!$C$14:$E$63,2,0))","v":""},{"$f":"IF(B760=\"\",\"\",VLOOKUP(B760,Colab!$C$14:$E$63,3,0))","v":""},null,{"$f":"IF(E760=\"\",\"\",VLOOKUP(E760,Treinamentos!$B$13:$G$42,5,0))","v":""},null,null,null,null,null,{"$f":"IF(E760=\"\",\"\",VLOOKUP(E760,Treinamentos!$B$13:$G$42,6,0))","v":""}]
[null,null,{"$f":"IF(B761=\"\",\"\",VLOOKUP(B761,Colab!$C$14:$E$63,2,0))","v":""},{"$f":"IF(B761=\"\",\"\",VLOOKUP(B761,Colab!$C$14:$E$63,3,0))","v":""},null,{"$f":"IF(E761=\"\",\"\",VLOOKUP(E761,Treinamentos!$B$13:$G$42,5,0))","v":""},null,null,null,null,null,{"$f":"IF(E761=\"\",\"\",VLOOKUP(E761,Treinamentos!$B$13:$G$42,6,0))","v":""}]
[null,null,{"$f":"IF(B762=\"\",\"\",VLOOKUP(B762,Colab!$C$14:$E$63,2,0))","v":""},{"$f":"IF(B762=\"\",\"\",VLOOKUP(B762,Colab!$C$14:$E$63,3,0))","v":""},null,{"$f":"IF(E762=\"\",\"\",VLOOKUP(E762,Treinamentos!$B$13:$G$42,5,0))","v":""},null,null,null,null,null,{"$f":"IF(E762=\"\",\"\",VLOOKUP(E762,Treinamentos!$B$13:$G$42,6,0))","v":""}]
[null,null,{"$f":"IF(B763=\"\",\"\",VLOOKUP(B763,Colab!$C$14:$E$63,2,0))","v":""},{"$f":"IF(B763=\"\",\"\",VLOOKUP(B763,Colab!$C$14:$E$63,3,0))","v":""},null,{"$f":"IF(E763=\"\",\"\",VLOOKUP(E763,Treinamentos!$B$13:$G$42,5,0))","v":""},null,null,null,null,null,{"$f":"IF(E763=\"\",\"\",VLOOKUP(E763,Treinamentos!$B$13:$G$42,6,0))","v":""}]
[null,null,{"$f":"IF(B764=\"\",\"\",VLOOKUP(B764,Colab!$C$14:$E$63,2,0))","v":""},{"$f":"IF(B764=\"\",\"\",VLOOKUP(B764,Colab!$C$14:$E$63,3,0))","v":""},null,{"$f":"IF(E764=\"\",\"\",VLOOKUP(E764,Treinamentos!$B$13:$G$42,5,0))","v":""},null,null,null,null,null,{"$f":"IF(E764=\"\",\"\",VLOOKUP(E764,Treinamentos!$B$13:$G$42,6,0))","v":""}]
[null,null,{"$f":"IF(B765=\"\",\"\",VLOOKUP(B765,Colab!$C$14:$E$63,2,0))","v":""},{"$f":"IF(B765=\"\",\"\",VLOOKUP(B765,Colab!$C$14:$E$63,3,0))","v":""},null,{"$f":"IF(E765=\"\",\"\",VLOOKUP(E765,Treinamentos!$B$13:$G$42,5,0))","v":""},null,null,null,null,null,{"$f":"IF(E765=\"\",\"\",VLOOKUP(E765,Treinamentos!$B$13:$G$42,6,0))","v":""}]
[null,null,{"$f":"IF(B766=\"\",\"\",VLOOKUP(B766,Colab!$C$14:$E$63,2,0))","v":""},{"$f":"IF(B766=\"\",\"\",VLOOKUP(B766,Colab!$C$14:$E$63,3,0))","v":""},null,{"$f":"IF(E766=\"\",\"\",VLOOKUP(E766,Treinamentos!$B$13:$G$42,5,0))","v":""},null,null,null,null,null,{"$f":"IF(E766=\"\",\"\",VLOOKUP(E766,Treinamentos!$B$13:$G$42,6,0))","v":""}]
[null,null,{"$f":"IF(B767=\"\",\"\",VLOOKUP(B767,Colab!$C$14:$E$63,2,0))","v":""},{"$f":"IF(B767=\"\",\"\",VLOOKUP(B767,Colab!$C$14:$E$63,3,0))","v":""},null,{"$f":"IF(E767=\"\",\"\",VLOOKUP(E767,Treinamentos!$B$13:$G$42,5,0))","v":""},null,null,null,null,null,{"$f":"IF(E767=\"\",\"\",VLOOKUP(E767,Treinamentos!$B$13:$G$42,6,0))","v":""}]
[null,null,{"$f":"IF(B768=\"\",\"\",VLOOKUP(B768,Colab!$C$14:$E$63,2,0))","v":""},{"$f":"IF(B768=\"\",\"\",VLOOKUP(B768,Colab!$C$14:$E$63,3,0))","v":""},null,{"$f":"IF(E768=\"\",\"\",VLOOKUP(E768,Treinamentos!$B$13:$G$42,5,0))","v":""},null,null,null,null,null,{"$f":"IF(E768=\"\",\"\",VLOOKUP(E768,Treinamentos!$B$13:$G$42,6,0))","v":""}]
[null,null,{"$f":"IF(B769=\"\",\"\",VLOOKUP(B769,Colab!$C$14:$E$63,2,0))","v":""},{"$f":"IF(B769=\"\",\"\",VLOOKUP(B769,Colab!$C$14:$E$63,3,0))","v":""},null,{"$f":"IF(E769=\"\",\"\",VLOOKUP(E769,Treinamentos!$B$13:$G$42,5,0))","v":""},null,null,null,null,null,{"$f":"IF(E769=\"\",\"\",VLOOKUP(E769,Treinamentos!$B$13:$G$42,6,0))","v":""}]
[null,null,{"$f":"IF(B770=\"\",\"\",VLOOKUP(B770,Colab!$C$14:$E$63,2,0))","v":""},{"$f":"IF(B770=\"\",\"\",VLOOKUP(B770,Colab!$C$14:$E$63,3,0))","v":""},null,{"$f":"IF(E770=\"\",\"\",VLOOKUP(E770,Treinamentos!$B$13:$G$42,5,0))","v":""},null,null,null,null,null,{"$f":"IF(E770=\"\",\"\",VLOOKUP(E770,Treinamentos!$B$13:$G$42,6,0))","v":""}]
[null,null,{"$f":"IF(B771=\"\",\"\",VLOOKUP(B771,Colab!$C$14:$E$63,2,0))","v":""},{"$f":"IF(B771=\"\",\"\",VLOOKUP(B771,Colab!$C$14:$E$63,3,0))","v":""},null,{"$f":"IF(E771=\"\",\"\",VLOOKUP(E771,Treinamentos!$B$13:$G$42,5,0))","v":""},null,null,null,null,null,{"$f":"IF(E771=\"\",\"\",VLOOKUP(E771,Treinamentos!$B$13:$G$42,6,0))","v":""}]
[null,null,{"$f":"IF(B772=\"\",\"\",VLOOKUP(B772,Colab!$C$14:$E$63,2,0))","v":""},{"$f":"IF(B772=\"\",\"\",VLOOKUP(B772,Colab!$C$14:$E$63,3,0))","v":""},null,{"$f":"IF(E772=\"\",\"\",VLOOKUP(E772,Treinamentos!$B$13:$G$42,5,0))","v":""},null,null,null,null,null,{"$f":"IF(E772=\"\",\"\",VLOOKUP(E772,Treinamentos!$B$13:$G$42,6,0))","v":""}]
[null,null,{"$f":"IF(B773=\"\",\"\",VLOOKUP(B773,Colab!$C$14:$E$63,2,0))","v":""},{"$f":"IF(B773=\"\",\"\",VLOOKUP(B773,Colab!$C$14:$E$63,3,0))","v":""},null,{"$f":"IF(E773=\"\",\"\",VLOOKUP(E773,Treinamentos!$B$13:$G$42,5,0))","v":""},null,null,null,null,null,{"$f":"IF(E773=\"\",\"\",VLOOKUP(E773,Treinamentos!$B$13:$G$42,6,0))","v":""}]
[null,null,{"$f":"IF(B774=\"\",\"\",VLOOKUP(B774,Colab!$C$14:$E$63,2,0))","v":""},{"$f":"IF(B774=\"\",\"\",VLOOKUP(B774,Colab!$C$14:$E$63,3,0))","v":""},null,{"$f":"IF(E774=\"\",\"\",VLOOKUP(E774,Treinamentos!$B$13:$G$42,5,0))","v":""},null,null,null,null,null,{"$f":"IF(E774=\"\",\"\",VLOOKUP(E774,Treinamentos!$B$13:$G$42,6,0))","v":""}]
[null,null,{"$f":"IF(B775=\"\",\"\",VLOOKUP(B775,Colab!$C$14:$E$63,2,0))","v":""},{"$f":"IF(B775=\"\",\"\",VLOOKUP(B775,Colab!$C$14:$E$63,3,0))","v":""},null,{"$f":"IF(E775=\"\",\"\",VLOOKUP(E775,Treinamentos!$B$13:$G$42,5,0))","v":""},null,null,null,null,null,{"$f":"IF(E775=\"\",\"\",VLOOKUP(E775,Treinamentos!$B$13:$G$42,6,0))","v":""}]
[null,null,{"$f":"IF(B776=\"\",\"\",VLOOKUP(B776,Colab!$C$14:$E$63,2,0))","v":""},{"$f":"IF(B776=\"\",\"\",VLOOKUP(B776,Colab!$C$14:$E$63,3,0))","v":""},null,{"$f":"IF(E776=\"\",\"\",VLOOKUP(E776,Treinamentos!$B$13:$G$42,5,0))","v":""},null,null,null,null,null,{"$f":"IF(E776=\"\",\"\",VLOOKUP(E776,Treinamentos!$B$13:$G$42,6,0))","v":""}]
[null,null,{"$f":"IF(B777=\"\",\"\",VLOOKUP(B777,Colab!$C$14:$E$63,2,0))","v":""},{"$f":"IF(B777=\"\",\"\",VLOOKUP(B777,Colab!$C$14:$E$63,3,0))","v":""},null,{"$f":"IF(E777=\"\",\"\",VLOOKUP(E777,Treinamentos!$B$13:$G$42,5,0))","v":""},null,null,null,null,null,{"$f":"IF(E777=\"\",\"\",VLOOKUP(E777,Treinamentos!$B$13:$G$42,6,0))","v":""}]
[null,null,{"$f":"IF(B778=\"\",\"\",VLOOKUP(B778,Colab!$C$14:$E$63,2,0))","v":""},{"$f":"IF(B778=\"\",\"\",VLOOKUP(B778,Colab!$C$14:$E$63,3,0))","v":""},null,{"$f":"IF(E778=\"\",\"\",VLOOKUP(E778,Treinamentos!$B$13:$G$42,5,0))","v":""},null,null,null,null,null,{"$f":"IF(E778=\"\",\"\",VLOOKUP(E778,Treinamentos!$B$13:$G$42,6,0))","v":""}]
[null,null,{"$f":"IF(B779=\"\",\"\",VLOOKUP(B779,Colab!$C$14:$E$63,2,0))","v":""},{"$f":"IF(B779=\"\",\"\",VLOOKUP(B779,Colab!$C$14:$E$63,3,0))","v":""},null,{"$f":"IF(E779=\"\",\"\",VLOOKUP(E779,Treinamentos!$B$13:$G$42,5,0))","v":""},null,null,null,null,null,{"$f":"IF(E779=\"\",\"\",VLOOKUP(E779,Treinamentos!$B$13:$G$42,6,0))","v":""}]
[null,null,{"$f":"IF(B780=\"\",\"\",VLOOKUP(B780,Colab!$C$14:$E$63,2,0))","v":""},{"$f":"IF(B780=\"\",\"\",VLOOKUP(B780,Colab!$C$14:$E$63,3,0))","v":""},null,{"$f":"IF(E780=\"\",\"\",VLOOKUP(E780,Treinamentos!$B$13:$G$42,5,0))","v":""},null,null,null,null,null,{"$f":"IF(E780=\"\",\"\",VLOOKUP(E780,Treinamentos!$B$13:$G$42,6,0))","v":""}]
[null,null,{"$f":"IF(B781=\"\",\"\",VLOOKUP(B781,Colab!$C$14:$E$63,2,0))","v":""},{"$f":"IF(B781=\"\",\"\",VLOOKUP(B781,Colab!$C$14:$E$63,3,0))","v":""},null,{"$f":"IF(E781=\"\",\"\",VLOOKUP(E781,Treinamentos!$B$13:$G$42,5,0))","v":""},null,null,null,null,null,{"$f":"IF(E781=\"\",\"\",VLOOKUP(E781,Treinamentos!$B$13:$G$42,6,0))","v":""}]
[null,null,{"$f":"IF(B782=\"\",\"\",VLOOKUP(B782,Colab!$C$14:$E$63,2,0))","v":""},{"$f":"IF(B782=\"\",\"\",VLOOKUP(B782,Colab!$C$14:$E$63,3,0))","v":""},null,{"$f":"IF(E782=\"\",\"\",VLOOKUP(E782,Treinamentos!$B$13:$G$42,5,0))","v":""},null,null,null,null,null,{"$f":"IF(E782=\"\",\"\",VLOOKUP(E782,Treinamentos!$B$13:$G$42,6,0))","v":""}]
[null,null,{"$f":"IF(B783=\"\",\"\",VLOOKUP(B783,Colab!$C$14:$E$63,2,0))","v":""},{"$f":"IF(B783=\"\",\"\",VLOOKUP(B783,Colab!$C$14:$E$63,3,0))","v":""},null,{"$f":"IF(E783=\"\",\"\",VLOOKUP(E783,Treinamentos!$B$13:$G$42,5,0))","v":""},null,null,null,null,null,{"$f":"IF(E783=\"\",\"\",VLOOKUP(E783,Treinamentos!$B$13:$G$42,6,0))","v":""}]
[null,null,{"$f":"IF(B784=\"\",\"\",VLOOKUP(B784,Colab!$C$14:$E$63,2,0))","v":""},{"$f":"IF(B784=\"\",\"\",VLOOKUP(B784,Colab!$C$14:$E$63,3,0))","v":""},null,{"$f":"IF(E784=\"\",\"\",VLOOKUP(E784,Treinamentos!$B$13:$G$42,5,0))","v":""},null,null,null,null,null,{"$f":"IF(E784=\"\",\"\",VLOOKUP(E784,Treinamentos!$B$13:$G$42,6,0))","v":""}]
[null,null,{"$f":"IF(B785=\"\",\"\",VLOOKUP(B785,Colab!$C$14:$E$63,2,0))","v":""},{"$f":"IF(B785=\"\",\"\",VLOOKUP(B785,Colab!$C$14:$E$63,3,0))","v":""},null,{"$f":"IF(E785=\"\",\"\",VLOOKUP(E785,Treinamentos!$B$13:$G$42,5,0))","v":""},null,null,null,null,null,{"$f":"IF(E785=\"\",\"\",VLOOKUP(E785,Treinamentos!$B$13:$G$42,6,0))","v":""}]
[null,null,{"$f":"IF(B786=\"\",\"\",VLOOKUP(B786,Colab!$C$14:$E$63,2,0))","v":""},{"$f":"IF(B786=\"\",\"\",VLOOKUP(B786,Colab!$C$14:$E$63,3,0))","v":""},null,{"$f":"IF(E786=\"\",\"\",VLOOKUP(E786,Treinamentos!$B$13:$G$42,5,0))","v":""},null,null,null,null,null,{"$f":"IF(E786=\"\",\"\",VLOOKUP(E786,Treinamentos!$B$13:$G$42,6,0))","v":""}]
[null,null,{"$f":"IF(B787=\"\",\"\",VLOOKUP(B787,Colab!$C$14:$E$63,2,0))","v":""},{"$f":"IF(B787=\"\",\"\",VLOOKUP(B787,Colab!$C$14:$E$63,3,0))","v":""},null,{"$f":"IF(E787=\"\",\"\",VLOOKUP(E787,Treinamentos!$B$13:$G$42,5,0))","v":""},null,null,null,null,null,{"$f":"IF(E787=\"\",\"\",VLOOKUP(E787,Treinamentos!$B$13:$G$42,6,0))","v":""}]
[null,null,{"$f":"IF(B788=\"\",\"\",VLOOKUP(B788,Colab!$C$14:$E$63,2,0))","v":""},{"$f":"IF(B788=\"\",\"\",VLOOKUP(B788,Colab!$C$14:$E$63,3,0))","v":""},null,{"$f":"IF(E788=\"\",\"\",VLOOKUP(E788,Treinamentos!$B$13:$G$42,5,0))","v":""},null,null,null,null,null,{"$f":"IF(E788=\"\",\"\",VLOOKUP(E788,Treinamentos!$B$13:$G$42,6,0))","v":""}]
[null,null,{"$f":"IF(B789=\"\",\"\",VLOOKUP(B789,Colab!$C$14:$E$63,2,0))","v":""},{"$f":"IF(B789=\"\",\"\",VLOOKUP(B789,Colab!$C$14:$E$63,3,0))","v":""},null,{"$f":"IF(E789=\"\",\"\",VLOOKUP(E789,Treinamentos!$B$13:$G$42,5,0))","v":""},null,null,null,null,null,{"$f":"IF(E789=\"\",\"\",VLOOKUP(E789,Treinamentos!$B$13:$G$42,6,0))","v":""}]
[null,null,{"$f":"IF(B790=\"\",\"\",VLOOKUP(B790,Colab!$C$14:$E$63,2,0))","v":""},{"$f":"IF(B790=\"\",\"\",VLOOKUP(B790,Colab!$C$14:$E$63,3,0))","v":""},null,{"$f":"IF(E790=\"\",\"\",VLOOKUP(E790,Treinamentos!$B$13:$G$42,5,0))","v":""},null,null,null,null,null,{"$f":"IF(E790=\"\",\"\",VLOOKUP(E790,Treinamentos!$B$13:$G$42,6,0))","v":""}]
[null,null,{"$f":"IF(B791=\"\",\"\",VLOOKUP(B791,Colab!$C$14:$E$63,2,0))","v":""},{"$f":"IF(B791=\"\",\"\",VLOOKUP(B791,Colab!$C$14:$E$63,3,0))","v":""},null,{"$f":"IF(E791=\"\",\"\",VLOOKUP(E791,Treinamentos!$B$13:$G$42,5,0))","v":""},null,null,null,null,null,{"$f":"IF(E791=\"\",\"\",VLOOKUP(E791,Treinamentos!$B$13:$G$42,6,0))","v":""}]
[null,null,{"$f":"IF(B792=\"\",\"\",VLOOKUP(B792,Colab!$C$14:$E$63,2,0))","v":""},{"$f":"IF(B792=\"\",\"\",VLOOKUP(B792,Colab!$C$14:$E$63,3,0))","v":""},null,{"$f":"IF(E792=\"\",\"\",VLOOKUP(E792,Treinamentos!$B$13:$G$42,5,0))","v":""},null,null,null,null,null,{"$f":"IF(E792=\"\",\"\",VLOOKUP(E792,Treinamentos!$B$13:$G$42,6,0))","v":""}]
[null,null,{"$f":"IF(B793=\"\",\"\",VLOOKUP(B793,Colab!$C$14:$E$63,2,0))","v":""},{"$f":"IF(B793=\"\",\"\",VLOOKUP(B793,Colab!$C$14:$E$63,3,0))","v":""},null,{"$f":"IF(E793=\"\",\"\",VLOOKUP(E793,Treinamentos!$B$13:$G$42,5,0))","v":""},null,null,null,null,null,{"$f":"IF(E793=\"\",\"\",VLOOKUP(E793,Treinamentos!$B$13:$G$42,6,0))","v":""}]
[null,null,{"$f":"IF(B794=\"\",\"\",VLOOKUP(B794,Colab!$C$14:$E$63,2,0))","v":""},{"$f":"IF(B794=\"\",\"\",VLOOKUP(B794,Colab!$C$14:$E$63,3,0))","v":""},null,{"$f":"IF(E794=\"\",\"\",VLOOKUP(E794,Treinamentos!$B$13:$G$42,5,0))","v":""},null,null,null,null,null,{"$f":"IF(E794=\"\",\"\",VLOOKUP(E794,Treinamentos!$B$13:$G$42,6,0))","v":""}]
[null,null,{"$f":"IF(B795=\"\",\"\",VLOOKUP(B795,Colab!$C$14:$E$63,2,0))","v":""},{"$f":"IF(B795=\"\",\"\",VLOOKUP(B795,Colab!$C$14:$E$63,3,0))","v":""},null,{"$f":"IF(E795=\"\",\"\",VLOOKUP(E795,Treinamentos!$B$13:$G$42,5,0))","v":""},null,null,null,null,null,{"$f":"IF(E795=\"\",\"\",VLOOKUP(E795,Treinamentos!$B$13:$G$42,6,0))","v":""}]
[null,null,{"$f":"IF(B796=\"\",\"\",VLOOKUP(B796,Colab!$C$14:$E$63,2,0))","v":""},{"$f":"IF(B796=\"\",\"\",VLOOKUP(B796,Colab!$C$14:$E$63,3,0))","v":""},null,{"$f":"IF(E796=\"\",\"\",VLOOKUP(E796,Treinamentos!$B$13:$G$42,5,0))","v":""},null,null,null,null,null,{"$f":"IF(E796=\"\",\"\",VLOOKUP(E796,Treinamentos!$B$13:$G$42,6,0))","v":""}]
[null,null,{"$f":"IF(B797=\"\",\"\",VLOOKUP(B797,Colab!$C$14:$E$63,2,0))","v":""},{"$f":"IF(B797=\"\",\"\",VLOOKUP(B797,Colab!$C$14:$E$63,3,0))","v":""},null,{"$f":"IF(E797=\"\",\"\",VLOOKUP(E797,Treinamentos!$B$13:$G$42,5,0))","v":""},null,null,null,null,null,{"$f":"IF(E797=\"\",\"\",VLOOKUP(E797,Treinamentos!$B$13:$G$42,6,0))","v":""}]
[null,null,{"$f":"IF(B798=\"\",\"\",VLOOKUP(B798,Colab!$C$14:$E$63,2,0))","v":""},{"$f":"IF(B798=\"\",\"\",VLOOKUP(B798,Colab!$C$14:$E$63,3,0))","v":""},null,{"$f":"IF(E798=\"\",\"\",VLOOKUP(E798,Treinamentos!$B$13:$G$42,5,0))","v":""},null,null,null,null,null,{"$f":"IF(E798=\"\",\"\",VLOOKUP(E798,Treinamentos!$B$13:$G$42,6,0))","v":""}]
[null,null,{"$f":"IF(B799=\"\",\"\",VLOOKUP(B799,Colab!$C$14:$E$63,2,0))","v":""},{"$f":"IF(B799=\"\",\"\",VLOOKUP(B799,Colab!$C$14:$E$63,3,0))","v":""},null,{"$f":"IF(E799=\"\",\"\",VLOOKUP(E799,Treinamentos!$B$13:$G$42,5,0))","v":""},null,null,null,null,null,{"$f":"IF(E799=\"\",\"\",VLOOKUP(E799,Treinamentos!$B$13:$G$42,6,0))","v":""}]
[null,null,{"$f":"IF(B800=\"\",\"\",VLOOKUP(B800,Colab!$C$14:$E$63,2,0))","v":""},{"$f":"IF(B800=\"\",\"\",VLOOKUP(B800,Colab!$C$14:$E$63,3,0))","v":""},null,{"$f":"IF(E800=\"\",\"\",VLOOKUP(E800,Treinamentos!$B$13:$G$42,5,0))","v":""},null,null,null,null,null,{"$f":"IF(E800=\"\",\"\",VLOOKUP(E800,Treinamentos!$B$13:$G$42,6,0))","v":""}]
[null,null,{"$f":"IF(B801=\"\",\"\",VLOOKUP(B801,Colab!$C$14:$E$63,2,0))","v":""},{"$f":"IF(B801=\"\",\"\",VLOOKUP(B801,Colab!$C$14:$E$63,3,0))","v":""},null,{"$f":"IF(E801=\"\",\"\",VLOOKUP(E801,Treinamentos!$B$13:$G$42,5,0))","v":""},null,null,null,null,null,{"$f":"IF(E801=\"\",\"\",VLOOKUP(E801,Treinamentos!$B$13:$G$42,6,0))","v":""}]
[null,null,{"$f":"IF(B802=\"\",\"\",VLOOKUP(B802,Colab!$C$14:$E$63,2,0))","v":""},{"$f":"IF(B802=\"\",\"\",VLOOKUP(B802,Colab!$C$14:$E$63,3,0))","v":""},null,{"$f":"IF(E802=\"\",\"\",VLOOKUP(E802,Treinamentos!$B$13:$G$42,5,0))","v":""},null,null,null,null,null,{"$f":"IF(E802=\"\",\"\",VLOOKUP(E802,Treinamentos!$B$13:$G$42,6,0))","v":""}]
[null,null,{"$f":"IF(B803=\"\",\"\",VLOOKUP(B803,Colab!$C$14:$E$63,2,0))","v":""},{"$f":"IF(B803=\"\",\"\",VLOOKUP(B803,Colab!$C$14:$E$63,3,0))","v":""},null,{"$f":"IF(E803=\"\",\"\",VLOOKUP(E803,Treinamentos!$B$13:$G$42,5,0))","v":""},null,null,null,null,null,{"$f":"IF(E803=\"\",\"\",VLOOKUP(E803,Treinamentos!$B$13:$G$42,6,0))","v":""}]
[null,null,{"$f":"IF(B804=\"\",\"\",VLOOKUP(B804,Colab!$C$14:$E$63,2,0))","v":""},{"$f":"IF(B804=\"\",\"\",VLOOKUP(B804,Colab!$C$14:$E$63,3,0))","v":""},null,{"$f":"IF(E804=\"\",\"\",VLOOKUP(E804,Treinamentos!$B$13:$G$42,5,0))","v":""},null,null,null,null,null,{"$f":"IF(E804=\"\",\"\",VLOOKUP(E804,Treinamentos!$B$13:$G$42,6,0))","v":""}]
[null,null,{"$f":"IF(B805=\"\",\"\",VLOOKUP(B805,Colab!$C$14:$E$63,2,0))","v":""},{"$f":"IF(B805=\"\",\"\",VLOOKUP(B805,Colab!$C$14:$E$63,3,0))","v":""},null,{"$f":"IF(E805=\"\",\"\",VLOOKUP(E805,Treinamentos!$B$13:$G$42,5,0))","v":""},null,null,null,null,null,{"$f":"IF(E805=\"\",\"\",VLOOKUP(E805,Treinamentos!$B$13:$G$42,6,0))","v":""}]
[null,null,{"$f":"IF(B806=\"\",\"\",VLOOKUP(B806,Colab!$C$14:$E$63,2,0))","v":""},{"$f":"IF(B806=\"\",\"\",VLOOKUP(B806,Colab!$C$14:$E$63,3,0))","v":""},null,{"$f":"IF(E806=\"\",\"\",VLOOKUP(E806,Treinamentos!$B$13:$G$42,5,0))","v":""},null,null,null,null,null,{"$f":"IF(E806=\"\",\"\",VLOOKUP(E806,Treinamentos!$B$13:$G$42,6,0))","v":""}]
[null,null,{"$f":"IF(B807=\"\",\"\",VLOOKUP(B807,Colab!$C$14:$E$63,2,0))","v":""},{"$f":"IF(B807=\"\",\"\",VLOOKUP(B807,Colab!$C$14:$E$63,3,0))","v":""},null,{"$f":"IF(E807=\"\",\"\",VLOOKUP(E807,Treinamentos!$B$13:$G$42,5,0))","v":""},null,null,null,null,null,{"$f":"IF(E807=\"\",\"\",VLOOKUP(E807,Treinamentos!$B$13:$G$42,6,0))","v":""}]
[null,null,{"$f":"IF(B808=\"\",\"\",VLOOKUP(B808,Colab!$C$14:$E$63,2,0))","v":""},{"$f":"IF(B808=\"\",\"\",VLOOKUP(B808,Colab!$C$14:$E$63,3,0))","v":""},null,{"$f":"IF(E808=\"\",\"\",VLOOKUP(E808,Treinamentos!$B$13:$G$42,5,0))","v":""},null,null,null,null,null,{"$f":"IF(E808=\"\",\"\",VLOOKUP(E808,Treinamentos!$B$13:$G$42,6,0))","v":""}]
[null,null,{"$f":"IF(B809=\"\",\"\",VLOOKUP(B809,Colab!$C$14:$E$63,2,0))","v":""},{"$f":"IF(B809=\"\",\"\",VLOOKUP(B809,Colab!$C$14:$E$63,3,0))","v":""},null,{"$f":"IF(E809=\"\",\"\",VLOOKUP(E809,Treinamentos!$B$13:$G$42,5,0))","v":""},null,null,null,null,null,{"$f":"IF(E809=\"\",\"\",VLOOKUP(E809,Treinamentos!$B$13:$G$42,6,0))","v":""}]
[null,null,{"$f":"IF(B810=\"\",\"\",VLOOKUP(B810,Colab!$C$14:$E$63,2,0))","v":""},{"$f":"IF(B810=\"\",\"\",VLOOKUP(B810,Colab!$C$14:$E$63,3,0))","v":""},null,{"$f":"IF(E810=\"\",\"\",VLOOKUP(E810,Treinamentos!$B$13:$G$42,5,0))","v":""},null,null,null,null,null,{"$f":"IF(E810=\"\",\"\",VLOOKUP(E810,Treinamentos!$B$13:$G$42,6,0))","v":""}]
[null,null,{"$f":"IF(B811=\"\",\"\",VLOOKUP(B811,Colab!$C$14:$E$63,2,0))","v":""},{"$f":"IF(B811=\"\",\"\",VLOOKUP(B811,Colab!$C$14:$E$63,3,0))","v":""},null,{"$f":"IF(E811=\"\",\"\",VLOOKUP(E811,Treinamentos!$B$13:$G$42,5,0))","v":""},null,null,null,null,null,{"$f":"IF(E811=\"\",\"\",VLOOKUP(E811,Treinamentos!$B$13:$G$42,6,0))","v":""}]
[null,null,{"$f":"IF(B812=\"\",\"\",VLOOKUP(B812,Colab!$C$14:$E$63,2,0))","v":""},{"$f":"IF(B812=\"\",\"\",VLOOKUP(B812,Colab!$C$14:$E$63,3,0))","v":""},null,{"$f":"IF(E812=\"\",\"\",VLOOKUP(E812,Treinamentos!$B$13:$G$42,5,0))","v":""},null,null,null,null,null,{"$f":"IF(E812=\"\",\"\",VLOOKUP(E812,Treinamentos!$B$13:$G$42,6,0))","v":""}]
[null,null,{"$f":"IF(B813=\"\",\"\",VLOOKUP(B813,Colab!$C$14:$E$63,2,0))","v":""},{"$f":"IF(B813=\"\",\"\",VLOOKUP(B813,Colab!$C$14:$E$63,3,0))","v":""},null,{"$f":"IF(E813=\"\",\"\",VLOOKUP(E813,Treinamentos!$B$13:$G$42,5,0))","v":""},null,null,null,null,null,{"$f":"IF(E813=\"\",\"\",VLOOKUP(E813,Treinamentos!$B$13:$G$42,6,0))","v":""}]
[null,null,{"$f":"IF(B814=\"\",\"\",VLOOKUP(B814,Colab!$C$14:$E$63,2,0))","v":""},{"$f":"IF(B814=\"\",\"\",VLOOKUP(B814,Colab!$C$14:$E$63,3,0))","v":""},null,{"$f":"IF(E814=\"\",\"\",VLOOKUP(E814,Treinamentos!$B$13:$G$42,5,0))","v":""},null,null,null,null,null,{"$f":"IF(E814=\"\",\"\",VLOOKUP(E814,Treinamentos!$B$13:$G$42,6,0))","v":""}]
[null,null,{"$f":"IF(B815=\"\",\"\",VLOOKUP(B815,Colab!$C$14:$E$63,2,0))","v":""},{"$f":"IF(B815=\"\",\"\",VLOOKUP(B815,Colab!$C$14:$E$63,3,0))","v":""},null,{"$f":"IF(E815=\"\",\"\",VLOOKUP(E815,Treinamentos!$B$13:$G$42,5,0))","v":""},null,null,null,null,null,{"$f":"IF(E815=\"\",\"\",VLOOKUP(E815,Treinamentos!$B$13:$G$42,6,0))","v":""}]
[null,null,{"$f":"IF(B816=\"\",\"\",VLOOKUP(B816,Colab!$C$14:$E$63,2,0))","v":""},{"$f":"IF(B816=\"\",\"\",VLOOKUP(B816,Colab!$C$14:$E$63,3,0))","v":""},null,{"$f":"IF(E816=\"\",\"\",VLOOKUP(E816,Treinamentos!$B$13:$G$42,5,0))","v":""},null,null,null,null,null,{"$f":"IF(E816=\"\",\"\",VLOOKUP(E816,Treinamentos!$B$13:$G$42,6,0))","v":""}]
[null,null,{"$f":"IF(B817=\"\",\"\",VLOOKUP(B817,Colab!$C$14:$E$63,2,0))","v":""},{"$f":"IF(B817=\"\",\"\",VLOOKUP(B817,Colab!$C$14:$E$63,3,0))","v":""},null,{"$f":"IF(E817=\"\",\"\",VLOOKUP(E817,Treinamentos!$B$13:$G$42,5,0))","v":""},null,null,null,null,null,{"$f":"IF(E817=\"\",\"\",VLOOKUP(E817,Treinamentos!$B$13:$G$42,6,0))","v":""}]
[null,null,{"$f":"IF(B818=\"\",\"\",VLOOKUP(B818,Colab!$C$14:$E$63,2,0))","v":""},{"$f":"IF(B818=\"\",\"\",VLOOKUP(B818,Colab!$C$14:$E$63,3,0))","v":""},null,{"$f":"IF(E818=\"\",\"\",VLOOKUP(E818,Treinamentos!$B$13:$G$42,5,0))","v":""},null,null,null,null,null,{"$f":"IF(E818=\"\",\"\",VLOOKUP(E818,Treinamentos!$B$13:$G$42,6,0))","v":""}]
[null,null,{"$f":"IF(B819=\"\",\"\",VLOOKUP(B819,Colab!$C$14:$E$63,2,0))","v":""},{"$f":"IF(B819=\"\",\"\",VLOOKUP(B819,Colab!$C$14:$E$63,3,0))","v":""},null,{"$f":"IF(E819=\"\",\"\",VLOOKUP(E819,Treinamentos!$B$13:$G$42,5,0))","v":""},null,null,null,null,null,{"$f":"IF(E819=\"\",\"\",VLOOKUP(E819,Treinamentos!$B$13:$G$42,6,0))","v":""}]
[null,null,{"$f":"IF(B820=\"\",\"\",VLOOKUP(B820,Colab!$C$14:$E$63,2,0))","v":""},{"$f":"IF(B820=\"\",\"\",VLOOKUP(B820,Colab!$C$14:$E$63,3,0))","v":""},null,{"$f":"IF(E820=\"\",\"\",VLOOKUP(E820,Treinamentos!$B$13:$G$42,5,0))","v":""},null,null,null,null,null,{"$f":"IF(E820=\"\",\"\",VLOOKUP(E820,Treinamentos!$B$13:$G$42,6,0))","v":""}]
[null,null,{"$f":"IF(B821=\"\",\"\",VLOOKUP(B821,Colab!$C$14:$E$63,2,0))","v":""},{"$f":"IF(B821=\"\",\"\",VLOOKUP(B821,Colab!$C$14:$E$63,3,0))","v":""},null,{"$f":"IF(E821=\"\",\"\",VLOOKUP(E821,Treinamentos!$B$13:$G$42,5,0))","v":""},null,null,null,null,null,{"$f":"IF(E821=\"\",\"\",VLOOKUP(E821,Treinamentos!$B$13:$G$42,6,0))","v":""}]
[null,null,{"$f":"IF(B822=\"\",\"\",VLOOKUP(B822,Colab!$C$14:$E$63,2,0))","v":""},{"$f":"IF(B822=\"\",\"\",VLOOKUP(B822,Colab!$C$14:$E$63,3,0))","v":""},null,{"$f":"IF(E822=\"\",\"\",VLOOKUP(E822,Treinamentos!$B$13:$G$42,5,0))","v":""},null,null,null,null,null,{"$f":"IF(E822=\"\",\"\",VLOOKUP(E822,Treinamentos!$B$13:$G$42,6,0))","v":""}]
[null,null,{"$f":"IF(B823=\"\",\"\",VLOOKUP(B823,Colab!$C$14:$E$63,2,0))","v":""},{"$f":"IF(B823=\"\",\"\",VLOOKUP(B823,Colab!$C$14:$E$63,3,0))","v":""},null,{"$f":"IF(E823=\"\",\"\",VLOOKUP(E823,Treinamentos!$B$13:$G$42,5,0))","v":""},null,null,null,null,null,{"$f":"IF(E823=\"\",\"\",VLOOKUP(E823,Treinamentos!$B$13:$G$42,6,0))","v":""}]
[null,null,{"$f":"IF(B824=\"\",\"\",VLOOKUP(B824,Colab!$C$14:$E$63,2,0))","v":""},{"$f":"IF(B824=\"\",\"\",VLOOKUP(B824,Colab!$C$14:$E$63,3,0))","v":""},null,{"$f":"IF(E824=\"\",\"\",VLOOKUP(E824,Treinamentos!$B$13:$G$42,5,0))","v":""},null,null,null,null,null,{"$f":"IF(E824=\"\",\"\",VLOOKUP(E824,Treinamentos!$B$13:$G$42,6,0))","v":""}]
[null,null,{"$f":"IF(B825=\"\",\"\",VLOOKUP(B825,Colab!$C$14:$E$63,2,0))","v":""},{"$f":"IF(B825=\"\",\"\",VLOOKUP(B825,Colab!$C$14:$E$63,3,0))","v":""},null,{"$f":"IF(E825=\"\",\"\",VLOOKUP(E825,Treinamentos!$B$13:$G$42,5,0))","v":""},null,null,null,null,null,{"$f":"IF(E825=\"\",\"\",VLOOKUP(E825,Treinamentos!$B$13:$G$42,6,0))","v":""}]
[null,null,{"$f":"IF(B826=\"\",\"\",VLOOKUP(B826,Colab!$C$14:$E$63,2,0))","v":""},{"$f":"IF(B826=\"\",\"\",VLOOKUP(B826,Colab!$C$14:$E$63,3,0))","v":""},null,{"$f":"IF(E826=\"\",\"\",VLOOKUP(E826,Treinamentos!$B$13:$G$42,5,0))","v":""},null,null,null,null,null,{"$f":"IF(E826=\"\",\"\",VLOOKUP(E826,Treinamentos!$B$13:$G$42,6,0))","v":""}]
[null,null,{"$f":"IF(B827=\"\",\"\",VLOOKUP(B827,Colab!$C$14:$E$63,2,0))","v":""},{"$f":"IF(B827=\"\",\"\",VLOOKUP(B827,Colab!$C$14:$E$63,3,0))","v":""},null,{"$f":"IF(E827=\"\",\"\",VLOOKUP(E827,Treinamentos!$B$13:$G$42,5,0))","v":""},null,null,null,null,null,{"$f":"IF(E827=\"\",\"\",VLOOKUP(E827,Treinamentos!$B$13:$G$42,6,0))","v":""}]
[null,null,{"$f":"IF(B828=\"\",\"\",VLOOKUP(B828,Colab!$C$14:$E$63,2,0))","v":""},{"$f":"IF(B828=\"\",\"\",VLOOKUP(B828,Colab!$C$14:$E$63,3,0))","v":""},null,{"$f":"IF(E828=\"\",\"\",VLOOKUP(E828,Treinamentos!$B$13:$G$42,5,0))","v":""},null,null,null,null,null,{"$f":"IF(E828=\"\",\"\",VLOOKUP(E828,Treinamentos!$B$13:$G$42,6,0))","v":""}]
[null,null,{"$f":"IF(B829=\"\",\"\",VLOOKUP(B829,Colab!$C$14:$E$63,2,0))","v":""},{"$f":"IF(B829=\"\",\"\",VLOOKUP(B829,Colab!$C$14:$E$63,3,0))","v":""},null,{"$f":"IF(E829=\"\",\"\",VLOOKUP(E829,Treinamentos!$B$13:$G$42,5,0))","v":""},null,null,null,null,null,{"$f":"IF(E829=\"\",\"\",VLOOKUP(E829,Treinamentos!$B$13:$G$42,6,0))","v":""}]
[null,null,{"$f":"IF(B830=\"\",\"\",VLOOKUP(B830,Colab!$C$14:$E$63,2,0))","v":""},{"$f":"IF(B830=\"\",\"\",VLOOKUP(B830,Colab!$C$14:$E$63,3,0))","v":""},null,{"$f":"IF(E830=\"\",\"\",VLOOKUP(E830,Treinamentos!$B$13:$G$42,5,0))","v":""},null,null,null,null,null,{"$f":"IF(E830=\"\",\"\",VLOOKUP(E830,Treinamentos!$B$13:$G$42,6,0))","v":""}]
[null,null,{"$f":"IF(B831=\"\",\"\",VLOOKUP(B831,Colab!$C$14:$E$63,2,0))","v":""},{"$f":"IF(B831=\"\",\"\",VLOOKUP(B831,Colab!$C$14:$E$63,3,0))","v":""},null,{"$f":"IF(E831=\"\",\"\",VLOOKUP(E831,Treinamentos!$B$13:$G$42,5,0))","v":""},null,null,null,null,null,{"$f":"IF(E831=\"\",\"\",VLOOKUP(E831,Treinamentos!$B$13:$G$42,6,0))","v":""}]
[null,null,{"$f":"IF(B832=\"\",\"\",VLOOKUP(B832,Colab!$C$14:$E$63,2,0))","v":""},{"$f":"IF(B832=\"\",\"\",VLOOKUP(B832,Colab!$C$14:$E$63,3,0))","v":""},null,{"$f":"IF(E832=\"\",\"\",VLOOKUP(E832,Treinamentos!$B$13:$G$42,5,0))","v":""},null,null,null,null,null,{"$f":"IF(E832=\"\",\"\",VLOOKUP(E832,Treinamentos!$B$13:$G$42,6,0))","v":""}]
[null,null,{"$f":"IF(B833=\"\",\"\",VLOOKUP(B833,Colab!$C$14:$E$63,2,0))","v":""},{"$f":"IF(B833=\"\",\"\",VLOOKUP(B833,Colab!$C$14:$E$63,3,0))","v":""},null,{"$f":"IF(E833=\"\",\"\",VLOOKUP(E833,Treinamentos!$B$13:$G$42,5,0))","v":""},null,null,null,null,null,{"$f":"IF(E833=\"\",\"\",VLOOKUP(E833,Treinamentos!$B$13:$G$42,6,0))","v":""}]
[null,null,{"$f":"IF(B834=\"\",\"\",VLOOKUP(B834,Colab!$C$14:$E$63,2,0))","v":""},{"$f":"IF(B834=\"\",\"\",VLOOKUP(B834,Colab!$C$14:$E$63,3,0))","v":""},null,{"$f":"IF(E834=\"\",\"\",VLOOKUP(E834,Treinamentos!$B$13:$G$42,5,0))","v":""},null,null,null,null,null,{"$f":"IF(E834=\"\",\"\",VLOOKUP(E834,Treinamentos!$B$13:$G$42,6,0))","v":""}]
[null,null,{"$f":"IF(B835=\"\",\"\",VLOOKUP(B835,Colab!$C$14:$E$63,2,0))","v":""},{"$f":"IF(B835=\"\",\"\",VLOOKUP(B835,Colab!$C$14:$E$63,3,0))","v":""},null,{"$f":"IF(E835=\"\",\"\",VLOOKUP(E835,Treinamentos!$B$13:$G$42,5,0))","v":""},null,null,null,null,null,{"$f":"IF(E835=\"\",\"\",VLOOKUP(E835,Treinamentos!$B$13:$G$42,6,0))","v":""}]
[null,null,{"$f":"IF(B836=\"\",\"\",VLOOKUP(B836,Colab!$C$14:$E$63,2,0))","v":""},{"$f":"IF(B836=\"\",\"\",VLOOKUP(B836,Colab!$C$14:$E$63,3,0))","v":""},null,{"$f":"IF(E836=\"\",\"\",VLOOKUP(E836,Treinamentos!$B$13:$G$42,5,0))","v":""},null,null,null,null,null,{"$f":"IF(E836=\"\",\"\",VLOOKUP(E836,Treinamentos!$B$13:$G$42,6,0))","v":""}]
[null,null,{"$f":"IF(B837=\"\",\"\",VLOOKUP(B837,Colab!$C$14:$E$63,2,0))","v":""},{"$f":"IF(B837=\"\",\"\",VLOOKUP(B837,Colab!$C$14:$E$63,3,0))","v":""},null,{"$f":"IF(E837=\"\",\"\",VLOOKUP(E837,Treinamentos!$B$13:$G$42,5,0))","v":""},null,null,null,null,null,{"$f":"IF(E837=\"\",\"\",VLOOKUP(E837,Treinamentos!$B$13:$G$42,6,0))","v":""}]
[null,null,{"$f":"IF(B838=\"\",\"\",VLOOKUP(B838,Colab!$C$14:$E$63,2,0))","v":""},{"$f":"IF(B838=\"\",\"\",VLOOKUP(B838,Colab!$C$14:$E$63,3,0))","v":""},null,{"$f":"IF(E838=\"\",\"\",VLOOKUP(E838,Treinamentos!$B$13:$G$42,5,0))","v":""},null,null,null,null,null,{"$f":"IF(E838=\"\",\"\",VLOOKUP(E838,Treinamentos!$B$13:$G$42,6,0))","v":""}]
[null,null,{"$f":"IF(B839=\"\",\"\",VLOOKUP(B839,Colab!$C$14:$E$63,2,0))","v":""},{"$f":"IF(B839=\"\",\"\",VLOOKUP(B839,Colab!$C$14:$E$63,3,0))","v":""},null,{"$f":"IF(E839=\"\",\"\",VLOOKUP(E839,Treinamentos!$B$13:$G$42,5,0))","v":""},null,null,null,null,null,{"$f":"IF(E839=\"\",\"\",VLOOKUP(E839,Treinamentos!$B$13:$G$42,6,0))","v":""}]
[null,null,{"$f":"IF(B840=\"\",\"\",VLOOKUP(B840,Colab!$C$14:$E$63,2,0))","v":""},{"$f":"IF(B840=\"\",\"\",VLOOKUP(B840,Colab!$C$14:$E$63,3,0))","v":""},null,{"$f":"IF(E840=\"\",\"\",VLOOKUP(E840,Treinamentos!$B$13:$G$42,5,0))","v":""},null,null,null,null,null,{"$f":"IF(E840=\"\",\"\",VLOOKUP(E840,Treinamentos!$B$13:$G$42,6,0))","v":""}]
[null,null,{"$f":"IF(B841=\"\",\"\",VLOOKUP(B841,Colab!$C$14:$E$63,2,0))","v":""},{"$f":"IF(B841=\"\",\"\",VLOOKUP(B841,Colab!$C$14:$E$63,3,0))","v":""},null,{"$f":"IF(E841=\"\",\"\",VLOOKUP(E841,Treinamentos!$B$13:$G$42,5,0))","v":""},null,null,null,null,null,{"$f":"IF(E841=\"\",\"\",VLOOKUP(E841,Treinamentos!$B$13:$G$42,6,0))","v":""}]
[null,null,{"$f":"IF(B842=\"\",\"\",VLOOKUP(B842,Colab!$C$14:$E$63,2,0))","v":""},{"$f":"IF(B842=\"\",\"\",VLOOKUP(B842,Colab!$C$14:$E$63,3,0))","v":""},null,{"$f":"IF(E842=\"\",\"\",VLOOKUP(E842,Treinamentos!$B$13:$G$42,5,0))","v":""},null,null,null,null,null,{"$f":"IF(E842=\"\",\"\",VLOOKUP(E842,Treinamentos!$B$13:$G$42,6,0))","v":""}]
[null,null,{"$f":"IF(B843=\"\",\"\",VLOOKUP(B843,Colab!$C$14:$E$63,2,0))","v":""},{"$f":"IF(B843=\"\",\"\",VLOOKUP(B843,Colab!$C$14:$E$63,3,0))","v":""},null,{"$f":"IF(E843=\"\",\"\",VLOOKUP(E843,Treinamentos!$B$13:$G$42,5,0))","v":""},null,null,null,null,null,{"$f":"IF(E843=\"\",\"\",VLOOKUP(E843,Treinamentos!$B$13:$G$42,6,0))","v":""}]
[null,null,{"$f":"IF(B844=\"\",\"\",VLOOKUP(B844,Colab!$C$14:$E$63,2,0))","v":""},{"$f":"IF(B844=\"\",\"\",VLOOKUP(B844,Colab!$C$14:$E$63,3,0))","v":""},null,{"$f":"IF(E844=\"\",\"\",VLOOKUP(E844,Treinamentos!$B$13:$G$42,5,0))","v":""},null,null,null,null,null,{"$f":"IF(E844=\"\",\"\",VLOOKUP(E844,Treinamentos!$B$13:$G$42,6,0))","v":""}]
[null,null,{"$f":"IF(B845=\"\",\"\",VLOOKUP(B845,Colab!$C$14:$E$63,2,0))","v":""},{"$f":"IF(B845=\"\",\"\",VLOOKUP(B845,Colab!$C$14:$E$63,3,0))","v":""},null,{"$f":"IF(E845=\"\",\"\",VLOOKUP(E845,Treinamentos!$B$13:$G$42,5,0))","v":""},null,null,null,null,null,{"$f":"IF(E845=\"\",\"\",VLOOKUP(E845,Treinamentos!$B$13:$G$42,6,0))","v":""}]
[null,null,{"$f":"IF(B846=\"\",\"\",VLOOKUP(B846,Colab!$C$14:$E$63,2,0))","v":""},{"$f":"IF(B846=\"\",\"\",VLOOKUP(B846,Colab!$C$14:$E$63,3,0))","v":""},null,{"$f":"IF(E846=\"\",\"\",VLOOKUP(E846,Treinamentos!$B$13:$G$42,5,0))","v":""},null,null,null,null,null,{"$f":"IF(E846=\"\",\"\",VLOOKUP(E846,Treinamentos!$B$13:$G$42,6,0))","v":""}]
[null,null,{"$f":"IF(B847=\"\",\"\",VLOOKUP(B847,Colab!$C$14:$E$63,2,0))","v":""},{"$f":"IF(B847=\"\",\"\",VLOOKUP(B847,Colab!$C$14:$E$63,3,0))","v":""},null,{"$f":"IF(E847=\"\",\"\",VLOOKUP(E847,Treinamentos!$B$13:$G$42,5,0))","v":""},null,null,null,null,null,{"$f":"IF(E847=\"\",\"\",VLOOKUP(E847,Treinamentos!$B$13:$G$42,6,0))","v":""}]
[null,null,{"$f":"IF(B848=\"\",\"\",VLOOKUP(B848,Colab!$C$14:$E$63,2,0))","v":""},{"$f":"IF(B848=\"\",\"\",VLOOKUP(B848,Colab!$C$14:$E$63,3,0))","v":""},null,{"$f":"IF(E848=\"\",\"\",VLOOKUP(E848,Treinamentos!$B$13:$G$42,5,0))","v":""},null,null,null,null,null,{"$f":"IF(E848=\"\",\"\",VLOOKUP(E848,Treinamentos!$B$13:$G$42,6,0))","v":""}]
[null,null,{"$f":"IF(B849=\"\",\"\",VLOOKUP(B849,Colab!$C$14:$E$63,2,0))","v":""},{"$f":"IF(B849=\"\",\"\",VLOOKUP(B849,Colab!$C$14:$E$63,3,0))","v":""},null,{"$f":"IF(E849=\"\",\"\",VLOOKUP(E849,Treinamentos!$B$13:$G$42,5,0))","v":""},null,null,null,null,null,{"$f":"IF(E849=\"\",\"\",VLOOKUP(E849,Treinamentos!$B$13:$G$42,6,0))","v":""}]
[null,null,{"$f":"IF(B850=\"\",\"\",VLOOKUP(B850,Colab!$C$14:$E$63,2,0))","v":""},{"$f":"IF(B850=\"\",\"\",VLOOKUP(B850,Colab!$C$14:$E$63,3,0))","v":""},null,{"$f":"IF(E850=\"\",\"\",VLOOKUP(E850,Treinamentos!$B$13:$G$42,5,0))","v":""},null,null,null,null,null,{"$f":"IF(E850=\"\",\"\",VLOOKUP(E850,Treinamentos!$B$13:$G$42,6,0))","v":""}]
[null,null,{"$f":"IF(B851=\"\",\"\",VLOOKUP(B851,Colab!$C$14:$E$63,2,0))","v":""},{"$f":"IF(B851=\"\",\"\",VLOOKUP(B851,Colab!$C$14:$E$63,3,0))","v":""},null,{"$f":"IF(E851=\"\",\"\",VLOOKUP(E851,Treinamentos!$B$13:$G$42,5,0))","v":""},null,null,null,null,null,{"$f":"IF(E851=\"\",\"\",VLOOKUP(E851,Treinamentos!$B$13:$G$42,6,0))","v":""}]
[null,null,{"$f":"IF(B852=\"\",\"\",VLOOKUP(B852,Colab!$C$14:$E$63,2,0))","v":""},{"$f":"IF(B852=\"\",\"\",VLOOKUP(B852,Colab!$C$14:$E$63,3,0))","v":""},null,{"$f":"IF(E852=\"\",\"\",VLOOKUP(E852,Treinamentos!$B$13:$G$42,5,0))","v":""},null,null,null,null,null,{"$f":"IF(E852=\"\",\"\",VLOOKUP(E852,Treinamentos!$B$13:$G$42,6,0))","v":""}]
[null,null,{"$f":"IF(B853=\"\",\"\",VLOOKUP(B853,Colab!$C$14:$E$63,2,0))","v":""},{"$f":"IF(B853=\"\",\"\",VLOOKUP(B853,Colab!$C$14:$E$63,3,0))","v":""},null,{"$f":"IF(E853=\"\",\"\",VLOOKUP(E853,Treinamentos!$B$13:$G$42,5,0))","v":""},null,null,null,null,null,{"$f":"IF(E853=\"\",\"\",VLOOKUP(E853,Treinamentos!$B$13:$G$42,6,0))","v":""}]
[null,null,{"$f":"IF(B854=\"\",\"\",VLOOKUP(B854,Colab!$C$14:$E$63,2,0))","v":""},{"$f":"IF(B854=\"\",\"\",VLOOKUP(B854,Colab!$C$14:$E$63,3,0))","v":""},null,{"$f":"IF(E854=\"\",\"\",VLOOKUP(E854,Treinamentos!$B$13:$G$42,5,0))","v":""},null,null,null,null,null,{"$f":"IF(E854=\"\",\"\",VLOOKUP(E854,Treinamentos!$B$13:$G$42,6,0))","v":""}]
[null,null,{"$f":"IF(B855=\"\",\"\",VLOOKUP(B855,Colab!$C$14:$E$63,2,0))","v":""},{"$f":"IF(B855=\"\",\"\",VLOOKUP(B855,Colab!$C$14:$E$63,3,0))","v":""},null,{"$f":"IF(E855=\"\",\"\",VLOOKUP(E855,Treinamentos!$B$13:$G$42,5,0))","v":""},null,null,null,null,null,{"$f":"IF(E855=\"\",\"\",VLOOKUP(E855,Treinamentos!$B$13:$G$42,6,0))","v":""}]
[null,null,{"$f":"IF(B856=\"\",\"\",VLOOKUP(B856,Colab!$C$14:$E$63,2,0))","v":""},{"$f":"IF(B856=\"\",\"\",VLOOKUP(B856,Colab!$C$14:$E$63,3,0))","v":""},null,{"$f":"IF(E856=\"\",\"\",VLOOKUP(E856,Treinamentos!$B$13:$G$42,5,0))","v":""},null,null,null,null,null,{"$f":"IF(E856=\"\",\"\",VLOOKUP(E856,Treinamentos!$B$13:$G$42,6,0))","v":""}]
[null,null,{"$f":"IF(B857=\"\",\"\",VLOOKUP(B857,Colab!$C$14:$E$63,2,0))","v":""},{"$f":"IF(B857=\"\",\"\",VLOOKUP(B857,Colab!$C$14:$E$63,3,0))","v":""},null,{"$f":"IF(E857=\"\",\"\",VLOOKUP(E857,Treinamentos!$B$13:$G$42,5,0))","v":""},null,null,null,null,null,{"$f":"IF(E857=\"\",\"\",VLOOKUP(E857,Treinamentos!$B$13:$G$42,6,0))","v":""}]
[null,null,{"$f":"IF(B858=\"\",\"\",VLOOKUP(B858,Colab!$C$14:$E$63,2,0))","v":""},{"$f":"IF(B858=\"\",\"\",VLOOKUP(B858,Colab!$C$14:$E$63,3,0))","v":""},null,{"$f":"IF(E858=\"\",\"\",VLOOKUP(E858,Treinamentos!$B$13:$G$42,5,0))","v":""},null,null,null,null,null,{"$f":"IF(E858=\"\",\"\",VLOOKUP(E858,Treinamentos!$B$13:$G$42,6,0))","v":""}]
[null,null,{"$f":"IF(B859=\"\",\"\",VLOOKUP(B859,Colab!$C$14:$E$63,2,0))","v":""},{"$f":"IF(B859=\"\",\"\",VLOOKUP(B859,Colab!$C$14:$E$63,3,0))","v":""},null,{"$f":"IF(E859=\"\",\"\",VLOOKUP(E859,Treinamentos!$B$13:$G$42,5,0))","v":""},null,null,null,null,null,{"$f":"IF(E859=\"\",\"\",VLOOKUP(E859,Treinamentos!$B$13:$G$42,6,0))","v":""}]
[null,null,{"$f":"IF(B860=\"\",\"\",VLOOKUP(B860,Colab!$C$14:$E$63,2,0))","v":""},{"$f":"IF(B860=\"\",\"\",VLOOKUP(B860,Colab!$C$14:$E$63,3,0))","v":""},null,{"$f":"IF(E860=\"\",\"\",VLOOKUP(E860,Treinamentos!$B$13:$G$42,5,0))","v":""},null,null,null,null,null,{"$f":"IF(E860=\"\",\"\",VLOOKUP(E860,Treinamentos!$B$13:$G$42,6,0))","v":""}]
[null,null,{"$f":"IF(B861=\"\",\"\",VLOOKUP(B861,Colab!$C$14:$E$63,2,0))","v":""},{"$f":"IF(B861=\"\",\"\",VLOOKUP(B861,Colab!$C$14:$E$63,3,0))","v":""},null,{"$f":"IF(E861=\"\",\"\",VLOOKUP(E861,Treinamentos!$B$13:$G$42,5,0))","v":""},null,null,null,null,null,{"$f":"IF(E861=\"\",\"\",VLOOKUP(E861,Treinamentos!$B$13:$G$42,6,0))","v":""}]
[null,null,{"$f":"IF(B862=\"\",\"\",VLOOKUP(B862,Colab!$C$14:$E$63,2,0))","v":""},{"$f":"IF(B862=\"\",\"\",VLOOKUP(B862,Colab!$C$14:$E$63,3,0))","v":""},null,{"$f":"IF(E862=\"\",\"\",VLOOKUP(E862,Treinamentos!$B$13:$G$42,5,0))","v":""},null,null,null,null,null,{"$f":"IF(E862=\"\",\"\",VLOOKUP(E862,Treinamentos!$B$13:$G$42,6,0))","v":""}]
[null,null,{"$f":"IF(B863=\"\",\"\",VLOOKUP(B863,Colab!$C$14:$E$63,2,0))","v":""},{"$f":"IF(B863=\"\",\"\",VLOOKUP(B863,Colab!$C$14:$E$63,3,0))","v":""},null,{"$f":"IF(E863=\"\",\"\",VLOOKUP(E863,Treinamentos!$B$13:$G$42,5,0))","v":""},null,null,null,null,null,{"$f":"IF(E863=\"\",\"\",VLOOKUP(E863,Treinamentos!$B$13:$G$42,6,0))","v":""}]
[null,null,{"$f":"IF(B864=\"\",\"\",VLOOKUP(B864,Colab!$C$14:$E$63,2,0))","v":""},{"$f":"IF(B864=\"\",\"\",VLOOKUP(B864,Colab!$C$14:$E$63,3,0))","v":""},null,{"$f":"IF(E864=\"\",\"\",VLOOKUP(E864,Treinamentos!$B$13:$G$42,5,0))","v":""},null,null,null,null,null,{"$f":"IF(E864=\"\",\"\",VLOOKUP(E864,Treinamentos!$B$13:$G$42,6,0))","v":""}]
[null,null,{"$f":"IF(B865=\"\",\"\",VLOOKUP(B865,Colab!$C$14:$E$63,2,0))","v":""},{"$f":"IF(B865=\"\",\"\",VLOOKUP(B865,Colab!$C$14:$E$63,3,0))","v":""},null,{"$f":"IF(E865=\"\",\"\",VLOOKUP(E865,Treinamentos!$B$13:$G$42,5,0))","v":""},null,null,null,null,null,{"$f":"IF(E865=\"\",\"\",VLOOKUP(E865,Treinamentos!$B$13:$G$42,6,0))","v":""}]
[null,null,{"$f":"IF(B866=\"\",\"\",VLOOKUP(B866,Colab!$C$14:$E$63,2,0))","v":""},{"$f":"IF(B866=\"\",\"\",VLOOKUP(B866,Colab!$C$14:$E$63,3,0))","v":""},null,{"$f":"IF(E866=\"\",\"\",VLOOKUP(E866,Treinamentos!$B$13:$G$42,5,0))","v":""},null,null,null,null,null,{"$f":"IF(E866=\"\",\"\",VLOOKUP(E866,Treinamentos!$B$13:$G$42,6,0))","v":""}]
[null,null,{"$f":"IF(B867=\"\",\"\",VLOOKUP(B867,Colab!$C$14:$E$63,2,0))","v":""},{"$f":"IF(B867=\"\",\"\",VLOOKUP(B867,Colab!$C$14:$E$63,3,0))","v":""},null,{"$f":"IF(E867=\"\",\"\",VLOOKUP(E867,Treinamentos!$B$13:$G$42,5,0))","v":""},null,null,null,null,null,{"$f":"IF(E867=\"\",\"\",VLOOKUP(E867,Treinamentos!$B$13:$G$42,6,0))","v":""}]
[null,null,{"$f":"IF(B868=\"\",\"\",VLOOKUP(B868,Colab!$C$14:$E$63,2,0))","v":""},{"$f":"IF(B868=\"\",\"\",VLOOKUP(B868,Colab!$C$14:$E$63,3,0))","v":""},null,{"$f":"IF(E868=\"\",\"\",VLOOKUP(E868,Treinamentos!$B$13:$G$42,5,0))","v":""},null,null,null,null,null,{"$f":"IF(E868=\"\",\"\",VLOOKUP(E868,Treinamentos!$B$13:$G$42,6,0))","v":""}]
[null,null,{"$f":"IF(B869=\"\",\"\",VLOOKUP(B869,Colab!$C$14:$E$63,2,0))","v":""},{"$f":"IF(B869=\"\",\"\",VLOOKUP(B869,Colab!$C$14:$E$63,3,0))","v":""},null,{"$f":"IF(E869=\"\",\"\",VLOOKUP(E869,Treinamentos!$B$13:$G$42,5,0))","v":""},null,null,null,null,null,{"$f":"IF(E869=\"\",\"\",VLOOKUP(E869,Treinamentos!$B$13:$G$42,6,0))","v":""}]
[null,null,{"$f":"IF(B870=\"\",\"\",VLOOKUP(B870,Colab!$C$14:$E$63,2,0))","v":""},{"$f":"IF(B870=\"\",\"\",VLOOKUP(B870,Colab!$C$14:$E$63,3,0))","v":""},null,{"$f":"IF(E870=\"\",\"\",VLOOKUP(E870,Treinamentos!$B$13:$G$42,5,0))","v":""},null,null,null,null,null,{"$f":"IF(E870=\"\",\"\",VLOOKUP(E870,Treinamentos!$B$13:$G$42,6,0))","v":""}]
[null,null,{"$f":"IF(B871=\"\",\"\",VLOOKUP(B871,Colab!$C$14:$E$63,2,0))","v":""},{"$f":"IF(B871=\"\",\"\",VLOOKUP(B871,Colab!$C$14:$E$63,3,0))","v":""},null,{"$f":"IF(E871=\"\",\"\",VLOOKUP(E871,Treinamentos!$B$13:$G$42,5,0))","v":""},null,null,null,null,null,{"$f":"IF(E871=\"\",\"\",VLOOKUP(E871,Treinamentos!$B$13:$G$42,6,0))","v":""}]
[null,null,{"$f":"IF(B872=\"\",\"\",VLOOKUP(B872,Colab!$C$14:$E$63,2,0))","v":""},{"$f":"IF(B872=\"\",\"\",VLOOKUP(B872,Colab!$C$14:$E$63,3,0))","v":""},null,{"$f":"IF(E872=\"\",\"\",VLOOKUP(E872,Treinamentos!$B$13:$G$42,5,0))","v":""},null,null,null,null,null,{"$f":"IF(E872=\"\",\"\",VLOOKUP(E872,Treinamentos!$B$13:$G$42,6,0))","v":""}]
[null,null,{"$f":"IF(B873=\"\",\"\",VLOOKUP(B873,Colab!$C$14:$E$63,2,0))","v":""},{"$f":"IF(B873=\"\",\"\",VLOOKUP(B873,Colab!$C$14:$E$63,3,0))","v":""},null,{"$f":"IF(E873=\"\",\"\",VLOOKUP(E873,Treinamentos!$B$13:$G$42,5,0))","v":""},null,null,null,null,null,{"$f":"IF(E873=\"\",\"\",VLOOKUP(E873,Treinamentos!$B$13:$G$42,6,0))","v":""}]
[null,null,{"$f":"IF(B874=\"\",\"\",VLOOKUP(B874,Colab!$C$14:$E$63,2,0))","v":""},{"$f":"IF(B874=\"\",\"\",VLOOKUP(B874,Colab!$C$14:$E$63,3,0))","v":""},null,{"$f":"IF(E874=\"\",\"\",VLOOKUP(E874,Treinamentos!$B$13:$G$42,5,0))","v":""},null,null,null,null,null,{"$f":"IF(E874=\"\",\"\",VLOOKUP(E874,Treinamentos!$B$13:$G$42,6,0))","v":""}]
[null,null,{"$f":"IF(B875=\"\",\"\",VLOOKUP(B875,Colab!$C$14:$E$63,2,0))","v":""},{"$f":"IF(B875=\"\",\"\",VLOOKUP(B875,Colab!$C$14:$E$63,3,0))","v":""},null,{"$f":"IF(E875=\"\",\"\",VLOOKUP(E875,Treinamentos!$B$13:$G$42,5,0))","v":""},null,null,null,null,null,{"$f":"IF(E875=\"\",\"\",VLOOKUP(E875,Treinamentos!$B$13:$G$42,6,0))","v":""}]
[null,null,{"$f":"IF(B876=\"\",\"\",VLOOKUP(B876,Colab!$C$14:$E$63,2,0))","v":""},{"$f":"IF(B876=\"\",\"\",VLOOKUP(B876,Colab!$C$14:$E$63,3,0))","v":""},null,{"$f":"IF(E876=\"\",\"\",VLOOKUP(E876,Treinamentos!$B$13:$G$42,5,0))","v":""},null,null,null,null,null,{"$f":"IF(E876=\"\",\"\",VLOOKUP(E876,Treinamentos!$B$13:$G$42,6,0))","v":""}]
[null,null,{"$f":"IF(B877=\"\",\"\",VLOOKUP(B877,Colab!$C$14:$E$63,2,0))","v":""},{"$f":"IF(B877=\"\",\"\",VLOOKUP(B877,Colab!$C$14:$E$63,3,0))","v":""},null,{"$f":"IF(E877=\"\",\"\",VLOOKUP(E877,Treinamentos!$B$13:$G$42,5,0))","v":""},null,null,null,null,null,{"$f":"IF(E877=\"\",\"\",VLOOKUP(E877,Treinamentos!$B$13:$G$42,6,0))","v":""}]
[null,null,{"$f":"IF(B878=\"\",\"\",VLOOKUP(B878,Colab!$C$14:$E$63,2,0))","v":""},{"$f":"IF(B878=\"\",\"\",VLOOKUP(B878,Colab!$C$14:$E$63,3,0))","v":""},null,{"$f":"IF(E878=\"\",\"\",VLOOKUP(E878,Treinamentos!$B$13:$G$42,5,0))","v":""},null,null,null,null,null,{"$f":"IF(E878=\"\",\"\",VLOOKUP(E878,Treinamentos!$B$13:$G$42,6,0))","v":""}]
[null,null,{"$f":"IF(B879=\"\",\"\",VLOOKUP(B879,Colab!$C$14:$E$63,2,0))","v":""},{"$f":"IF(B879=\"\",\"\",VLOOKUP(B879,Colab!$C$14:$E$63,3,0))","v":""},null,{"$f":"IF(E879=\"\",\"\",VLOOKUP(E879,Treinamentos!$B$13:$G$42,5,0))","v":""},null,null,null,null,null,{"$f":"IF(E879=\"\",\"\",VLOOKUP(E879,Treinamentos!$B$13:$G$42,6,0))","v":""}]
[null,null,{"$f":"IF(B880=\"\",\"\",VLOOKUP(B880,Colab!$C$14:$E$63,2,0))","v":""},{"$f":"IF(B880=\"\",\"\",VLOOKUP(B880,Colab!$C$14:$E$63,3,0))","v":""},null,{"$f":"IF(E880=\"\",\"\",VLOOKUP(E880,Treinamentos!$B$13:$G$42,5,0))","v":""},null,null,null,null,null,{"$f":"IF(E880=\"\",\"\",VLOOKUP(E880,Treinamentos!$B$13:$G$42,6,0))","v":""}]
[null,null,{"$f":"IF(B881=\"\",\"\",VLOOKUP(B881,Colab!$C$14:$E$63,2,0))","v":""},{"$f":"IF(B881=\"\",\"\",VLOOKUP(B881,Colab!$C$14:$E$63,3,0))","v":""},null,{"$f":"IF(E881=\"\",\"\",VLOOKUP(E881,Treinamentos!$B$13:$G$42,5,0))","v":""},null,null,null,null,null,{"$f":"IF(E881=\"\",\"\",VLOOKUP(E881,Treinamentos!$B$13:$G$42,6,0))","v":""}]
[null,null,{"$f":"IF(B882=\"\",\"\",VLOOKUP(B882,Colab!$C$14:$E$63,2,0))","v":""},{"$f":"IF(B882=\"\",\"\",VLOOKUP(B882,Colab!$C$14:$E$63,3,0))","v":""},null,{"$f":"IF(E882=\"\",\"\",VLOOKUP(E882,Treinamentos!$B$13:$G$42,5,0))","v":""},null,null,null,null,null,{"$f":"IF(E882=\"\",\"\",VLOOKUP(E882,Treinamentos!$B$13:$G$42,6,0))","v":""}]
[null,null,{"$f":"IF(B883=\"\",\"\",VLOOKUP(B883,Colab!$C$14:$E$63,2,0))","v":""},{"$f":"IF(B883=\"\",\"\",VLOOKUP(B883,Colab!$C$14:$E$63,3,0))","v":""},null,{"$f":"IF(E883=\"\",\"\",VLOOKUP(E883,Treinamentos!$B$13:$G$42,5,0))","v":""},null,null,null,null,null,{"$f":"IF(E883=\"\",\"\",VLOOKUP(E883,Treinamentos!$B$13:$G$42,6,0))","v":""}]
[null,null,{"$f":"IF(B884=\"\",\"\",VLOOKUP(B884,Colab!$C$14:$E$63,2,0))","v":""},{"$f":"IF(B884=\"\",\"\",VLOOKUP(B884,Colab!$C$14:$E$63,3,0))","v":""},null,{"$f":"IF(E884=\"\",\"\",VLOOKUP(E884,Treinamentos!$B$13:$G$42,5,0))","v":""},null,null,null,null,null,{"$f":"IF(E884=\"\",\"\",VLOOKUP(E884,Treinamentos!$B$13:$G$42,6,0))","v":""}]
[null,null,{"$f":"IF(B885=\"\",\"\",VLOOKUP(B885,Colab!$C$14:$E$63,2,0))","v":""},{"$f":"IF(B885=\"\",\"\",VLOOKUP(B885,Colab!$C$14:$E$63,3,0))","v":""},null,{"$f":"IF(E885=\"\",\"\",VLOOKUP(E885,Treinamentos!$B$13:$G$42,5,0))","v":""},null,null,null,null,null,{"$f":"IF(E885=\"\",\"\",VLOOKUP(E885,Treinamentos!$B$13:$G$42,6,0))","v":""}]
[null,null,{"$f":"IF(B886=\"\",\"\",VLOOKUP(B886,Colab!$C$14:$E$63,2,0))","v":""},{"$f":"IF(B886=\"\",\"\",VLOOKUP(B886,Colab!$C$14:$E$63,3,0))","v":""},null,{"$f":"IF(E886=\"\",\"\",VLOOKUP(E886,Treinamentos!$B$13:$G$42,5,0))","v":""},null,null,null,null,null,{"$f":"IF(E886=\"\",\"\",VLOOKUP(E886,Treinamentos!$B$13:$G$42,6,0))","v":""}]
[null,null,{"$f":"IF(B887=\"\",\"\",VLOOKUP(B887,Colab!$C$14:$E$63,2,0))","v":""},{"$f":"IF(B887=\"\",\"\",VLOOKUP(B887,Colab!$C$14:$E$63,3,0))","v":""},null,{"$f":"IF(E887=\"\",\"\",VLOOKUP(E887,Treinamentos!$B$13:$G$42,5,0))","v":""},null,null,null,null,null,{"$f":"IF(E887=\"\",\"\",VLOOKUP(E887,Treinamentos!$B$13:$G$42,6,0))","v":""}]
[null,null,{"$f":"IF(B888=\"\",\"\",VLOOKUP(B888,Colab!$C$14:$E$63,2,0))","v":""},{"$f":"IF(B888=\"\",\"\",VLOOKUP(B888,Colab!$C$14:$E$63,3,0))","v":""},null,{"$f":"IF(E888=\"\",\"\",VLOOKUP(E888,Treinamentos!$B$13:$G$42,5,0))","v":""},null,null,null,null,null,{"$f":"IF(E888=\"\",\"\",VLOOKUP(E888,Treinamentos!$B$13:$G$42,6,0))","v":""}]
[null,null,{"$f":"IF(B889=\"\",\"\",VLOOKUP(B889,Colab!$C$14:$E$63,2,0))","v":""},{"$f":"IF(B889=\"\",\"\",VLOOKUP(B889,Colab!$C$14:$E$63,3,0))","v":""},null,{"$f":"IF(E889=\"\",\"\",VLOOKUP(E889,Treinamentos!$B$13:$G$42,5,0))","v":""},null,null,null,null,null,{"$f":"IF(E889=\"\",\"\",VLOOKUP(E889,Treinamentos!$B$13:$G$42,6,0))","v":""}]
[null,null,{"$f":"IF(B890=\"\",\"\",VLOOKUP(B890,Colab!$C$14:$E$63,2,0))","v":""},{"$f":"IF(B890=\"\",\"\",VLOOKUP(B890,Colab!$C$14:$E$63,3,0))","v":""},null,{"$f":"IF(E890=\"\",\"\",VLOOKUP(E890,Treinamentos!$B$13:$G$42,5,0))","v":""},null,null,null,null,null,{"$f":"IF(E890=\"\",\"\",VLOOKUP(E890,Treinamentos!$B$13:$G$42,6,0))","v":""}]
[null,null,{"$f":"IF(B891=\"\",\"\",VLOOKUP(B891,Colab!$C$14:$E$63,2,0))","v":""},{"$f":"IF(B891=\"\",\"\",VLOOKUP(B891,Colab!$C$14:$E$63,3,0))","v":""},null,{"$f":"IF(E891=\"\",\"\",VLOOKUP(E891,Treinamentos!$B$13:$G$42,5,0))","v":""},null,null,null,null,null,{"$f":"IF(E891=\"\",\"\",VLOOKUP(E891,Treinamentos!$B$13:$G$42,6,0))","v":""}]
[null,null,{"$f":"IF(B892=\"\",\"\",VLOOKUP(B892,Colab!$C$14:$E$63,2,0))","v":""},{"$f":"IF(B892=\"\",\"\",VLOOKUP(B892,Colab!$C$14:$E$63,3,0))","v":""},null,{"$f":"IF(E892=\"\",\"\",VLOOKUP(E892,Treinamentos!$B$13:$G$42,5,0))","v":""},null,null,null,null,null,{"$f":"IF(E892=\"\",\"\",VLOOKUP(E892,Treinamentos!$B$13:$G$42,6,0))","v":""}]
[null,null,{"$f":"IF(B893=\"\",\"\",VLOOKUP(B893,Colab!$C$14:$E$63,2,0))","v":""},{"$f":"IF(B893=\"\",\"\",VLOOKUP(B893,Colab!$C$14:$E$63,3,0))","v":""},null,{"$f":"IF(E893=\"\",\"\",VLOOKUP(E893,Treinamentos!$B$13:$G$42,5,0))","v":""},null,null,null,null,null,{"$f":"IF(E893=\"\",\"\",VLOOKUP(E893,Treinamentos!$B$13:$G$42,6,0))","v":""}]
[null,null,{"$f":"IF(B894=\"\",\"\",VLOOKUP(B894,Colab!$C$14:$E$63,2,0))","v":""},{"$f":"IF(B894=\"\",\"\",VLOOKUP(B894,Colab!$C$14:$E$63,3,0))","v":""},null,{"$f":"IF(E894=\"\",\"\",VLOOKUP(E894,Treinamentos!$B$13:$G$42,5,0))","v":""},null,null,null,null,null,{"$f":"IF(E894=\"\",\"\",VLOOKUP(E894,Treinamentos!$B$13:$G$42,6,0))","v":""}]
[null,null,{"$f":"IF(B895=\"\",\"\",VLOOKUP(B895,Colab!$C$14:$E$63,2,0))","v":""},{"$f":"IF(B895=\"\",\"\",VLOOKUP(B895,Colab!$C$14:$E$63,3,0))","v":""},null,{"$f":"IF(E895=\"\",\"\",VLOOKUP(E895,Treinamentos!$B$13:$G$42,5,0))","v":""},null,null,null,null,null,{"$f":"IF(E895=\"\",\"\",VLOOKUP(E895,Treinamentos!$B$13:$G$42,6,0))","v":""}]
[null,null,{"$f":"IF(B896=\"\",\"\",VLOOKUP(B896,Colab!$C$14:$E$63,2,0))","v":""},{"$f":"IF(B896=\"\",\"\",VLOOKUP(B896,Colab!$C$14:$E$63,3,0))","v":""},null,{"$f":"IF(E896=\"\",\"\",VLOOKUP(E896,Treinamentos!$B$13:$G$42,5,0))","v":""},null,null,null,null,null,{"$f":"IF(E896=\"\",\"\",VLOOKUP(E896,Treinamentos!$B$13:$G$42,6,0))","v":""}]
[null,null,{"$f":"IF(B897=\"\",\"\",VLOOKUP(B897,Colab!$C$14:$E$63,2,0))","v":""},{"$f":"IF(B897=\"\",\"\",VLOOKUP(B897,Colab!$C$14:$E$63,3,0))","v":""},null,{"$f":"IF(E897=\"\",\"\",VLOOKUP(E897,Treinamentos!$B$13:$G$42,5,0))","v":""},null,null,null,null,null,{"$f":"IF(E897=\"\",\"\",VLOOKUP(E897,Treinamentos!$B$13:$G$42,6,0))","v":""}]
[null,null,{"$f":"IF(B898=\"\",\"\",VLOOKUP(B898,Colab!$C$14:$E$63,2,0))","v":""},{"$f":"IF(B898=\"\",\"\",VLOOKUP(B898,Colab!$C$14:$E$63,3,0))","v":""},null,{"$f":"IF(E898=\"\",\"\",VLOOKUP(E898,Treinamentos!$B$13:$G$42,5,0))","v":""},null,null,null,null,null,{"$f":"IF(E898=\"\",\"\",VLOOKUP(E898,Treinamentos!$B$13:$G$42,6,0))","v":""}]
[null,null,{"$f":"IF(B899=\"\",\"\",VLOOKUP(B899,Colab!$C$14:$E$63,2,0))","v":""},{"$f":"IF(B899=\"\",\"\",VLOOKUP(B899,Colab!$C$14:$E$63,3,0))","v":""},null,{"$f":"IF(E899=\"\",\"\",VLOOKUP(E899,Treinamentos!$B$13:$G$42,5,0))","v":""},null,null,null,null,null,{"$f":"IF(E899=\"\",\"\",VLOOKUP(E899,Treinamentos!$B$13:$G$42,6,0))","v":""}]
[null,null,{"$f":"IF(B900=\"\",\"\",VLOOKUP(B900,Colab!$C$14:$E$63,2,0))","v":""},{"$f":"IF(B900=\"\",\"\",VLOOKUP(B900,Colab!$C$14:$E$63,3,0))","v":""},null,{"$f":"IF(E900=\"\",\"\",VLOOKUP(E900,Treinamentos!$B$13:$G$42,5,0))","v":""},null,null,null,null,null,{"$f":"IF(E900=\"\",\"\",VLOOKUP(E900,Treinamentos!$B$13:$G$42,6,0))","v":""}]
[null,null,{"$f":"IF(B901=\"\",\"\",VLOOKUP(B901,Colab!$C$14:$E$63,2,0))","v":""},{"$f":"IF(B901=\"\",\"\",VLOOKUP(B901,Colab!$C$14:$E$63,3,0))","v":""},null,{"$f":"IF(E901=\"\",\"\",VLOOKUP(E901,Treinamentos!$B$13:$G$42,5,0))","v":""},null,null,null,null,null,{"$f":"IF(E901=\"\",\"\",VLOOKUP(E901,Treinamentos!$B$13:$G$42,6,0))","v":""}]
[null,null,{"$f":"IF(B902=\"\",\"\",VLOOKUP(B902,Colab!$C$14:$E$63,2,0))","v":""},{"$f":"IF(B902=\"\",\"\",VLOOKUP(B902,Colab!$C$14:$E$63,3,0))","v":""},null,{"$f":"IF(E902=\"\",\"\",VLOOKUP(E902,Treinamentos!$B$13:$G$42,5,0))","v":""},null,null,null,null,null,{"$f":"IF(E902=\"\",\"\",VLOOKUP(E902,Treinamentos!$B$13:$G$42,6,0))","v":""}]
[null,null,{"$f":"IF(B903=\"\",\"\",VLOOKUP(B903,Colab!$C$14:$E$63,2,0))","v":""},{"$f":"IF(B903=\"\",\"\",VLOOKUP(B903,Colab!$C$14:$E$63,3,0))","v":""},null,{"$f":"IF(E903=\"\",\"\",VLOOKUP(E903,Treinamentos!$B$13:$G$42,5,0))","v":""},null,null,null,null,null,{"$f":"IF(E903=\"\",\"\",VLOOKUP(E903,Treinamentos!$B$13:$G$42,6,0))","v":""}]
[null,null,{"$f":"IF(B904=\"\",\"\",VLOOKUP(B904,Colab!$C$14:$E$63,2,0))","v":""},{"$f":"IF(B904=\"\",\"\",VLOOKUP(B904,Colab!$C$14:$E$63,3,0))","v":""},null,{"$f":"IF(E904=\"\",\"\",VLOOKUP(E904,Treinamentos!$B$13:$G$42,5,0))","v":""},null,null,null,null,null,{"$f":"IF(E904=\"\",\"\",VLOOKUP(E904,Treinamentos!$B$13:$G$42,6,0))","v":""}]
[null,null,{"$f":"IF(B905=\"\",\"\",VLOOKUP(B905,Colab!$C$14:$E$63,2,0))","v":""},{"$f":"IF(B905=\"\",\"\",VLOOKUP(B905,Colab!$C$14:$E$63,3,0))","v":""},null,{"$f":"IF(E905=\"\",\"\",VLOOKUP(E905,Treinamentos!$B$13:$G$42,5,0))","v":""},null,null,null,null,null,{"$f":"IF(E905=\"\",\"\",VLOOKUP(E905,Treinamentos!$B$13:$G$42,6,0))","v":""}]
[null,null,{"$f":"IF(B906=\"\",\"\",VLOOKUP(B906,Colab!$C$14:$E$63,2,0))","v":""},{"$f":"IF(B906=\"\",\"\",VLOOKUP(B906,Colab!$C$14:$E$63,3,0))","v":""},null,{"$f":"IF(E906=\"\",\"\",VLOOKUP(E906,Treinamentos!$B$13:$G$42,5,0))","v":""},null,null,null,null,null,{"$f":"IF(E906=\"\",\"\",VLOOKUP(E906,Treinamentos!$B$13:$G$42,6,0))","v":""}]
[null,null,{"$f":"IF(B907=\"\",\"\",VLOOKUP(B907,Colab!$C$14:$E$63,2,0))","v":""},{"$f":"IF(B907=\"\",\"\",VLOOKUP(B907,Colab!$C$14:$E$63,3,0))","v":""},null,{"$f":"IF(E907=\"\",\"\",VLOOKUP(E907,Treinamentos!$B$13:$G$42,5,0))","v":""},null,null,null,null,null,{"$f":"IF(E907=\"\",\"\",VLOOKUP(E907,Treinamentos!$B$13:$G$42,6,0))","v":""}]
[null,null,{"$f":"IF(B908=\"\",\"\",VLOOKUP(B908,Colab!$C$14:$E$63,2,0))","v":""},{"$f":"IF(B908=\"\",\"\",VLOOKUP(B908,Colab!$C$14:$E$63,3,0))","v":""},null,{"$f":"IF(E908=\"\",\"\",VLOOKUP(E908,Treinamentos!$B$13:$G$42,5,0))","v":""},null,null,null,null,null,{"$f":"IF(E908=\"\",\"\",VLOOKUP(E908,Treinamentos!$B$13:$G$42,6,0))","v":""}]
[null,null,{"$f":"IF(B909=\"\",\"\",VLOOKUP(B909,Colab!$C$14:$E$63,2,0))","v":""},{"$f":"IF(B909=\"\",\"\",VLOOKUP(B909,Colab!$C$14:$E$63,3,0))","v":""},null,{"$f":"IF(E909=\"\",\"\",VLOOKUP(E909,Treinamentos!$B$13:$G$42,5,0))","v":""},null,null,null,null,null,{"$f":"IF(E909=\"\",\"\",VLOOKUP(E909,Treinamentos!$B$13:$G$42,6,0))","v":""}]
[null,null,{"$f":"IF(B910=\"\",\"\",VLOOKUP(B910,Colab!$C$14:$E$63,2,0))","v":""},{"$f":"IF(B910=\"\",\"\",VLOOKUP(B910,Colab!$C$14:$E$63,3,0))","v":""},null,{"$f":"IF(E910=\"\",\"\",VLOOKUP(E910,Treinamentos!$B$13:$G$42,5,0))","v":""},null,null,null,null,null,{"$f":"IF(E910=\"\",\"\",VLOOKUP(E910,Treinamentos!$B$13:$G$42,6,0))","v":""}]
[null,null,{"$f":"IF(B911=\"\",\"\",VLOOKUP(B911,Colab!$C$14:$E$63,2,0))","v":""},{"$f":"IF(B911=\"\",\"\",VLOOKUP(B911,Colab!$C$14:$E$63,3,0))","v":""},null,{"$f":"IF(E911=\"\",\"\",VLOOKUP(E911,Treinamentos!$B$13:$G$42,5,0))","v":""},null,null,null,null,null,{"$f":"IF(E911=\"\",\"\",VLOOKUP(E911,Treinamentos!$B$13:$G$42,6,0))","v":""}]
[null,null,{"$f":"IF(B912=\"\",\"\",VLOOKUP(B912,Colab!$C$14:$E$63,2,0))","v":""},{"$f":"IF(B912=\"\",\"\",VLOOKUP(B912,Colab!$C$14:$E$63,3,0))","v":""},null,{"$f":"IF(E912=\"\",\"\",VLOOKUP(E912,Treinamentos!$B$13:$G$42,5,0))","v":""},null,null,null,null,null,{"$f":"IF(E912=\"\",\"\",VLOOKUP(E912,Treinamentos!$B$13:$G$42,6,0))","v":""}]
[null,null,{"$f":"IF(B913=\"\",\"\",VLOOKUP(B913,Colab!$C$14:$E$63,2,0))","v":""},{"$f":"IF(B913=\"\",\"\",VLOOKUP(B913,Colab!$C$14:$E$63,3,0))","v":""},null,{"$f":"IF(E913=\"\",\"\",VLOOKUP(E913,Treinamentos!$B$13:$G$42,5,0))","v":""},null,null,null,null,null,{"$f":"IF(E913=\"\",\"\",VLOOKUP(E913,Treinamentos!$B$13:$G$42,6,0))","v":""}]
[null,null,{"$f":"IF(B914=\"\",\"\",VLOOKUP(B914,Colab!$C$14:$E$63,2,0))","v":""},{"$f":"IF(B914=\"\",\"\",VLOOKUP(B914,Colab!$C$14:$E$63,3,0))","v":""},null,{"$f":"IF(E914=\"\",\"\",VLOOKUP(E914,Treinamentos!$B$13:$G$42,5,0))","v":""},null,null,null,null,null,{"$f":"IF(E914=\"\",\"\",VLOOKUP(E914,Treinamentos!$B$13:$G$42,6,0))","v":""}]
[null,null,{"$f":"IF(B915=\"\",\"\",VLOOKUP(B915,Colab!$C$14:$E$63,2,0))","v":""},{"$f":"IF(B915=\"\",\"\",VLOOKUP(B915,Colab!$C$14:$E$63,3,0))","v":""},null,{"$f":"IF(E915=\"\",\"\",VLOOKUP(E915,Treinamentos!$B$13:$G$42,5,0))","v":""},null,null,null,null,null,{"$f":"IF(E915=\"\",\"\",VLOOKUP(E915,Treinamentos!$B$13:$G$42,6,0))","v":""}]
[null,null,{"$f":"IF(B916=\"\",\"\",VLOOKUP(B916,Colab!$C$14:$E$63,2,0))","v":""},{"$f":"IF(B916=\"\",\"\",VLOOKUP(B916,Colab!$C$14:$E$63,3,0))","v":""},null,{"$f":"IF(E916=\"\",\"\",VLOOKUP(E916,Treinamentos!$B$13:$G$42,5,0))","v":""},null,null,null,null,null,{"$f":"IF(E916=\"\",\"\",VLOOKUP(E916,Treinamentos!$B$13:$G$42,6,0))","v":""}]
[null,null,{"$f":"IF(B917=\"\",\"\",VLOOKUP(B917,Colab!$C$14:$E$63,2,0))","v":""},{"$f":"IF(B917=\"\",\"\",VLOOKUP(B917,Colab!$C$14:$E$63,3,0))","v":""},null,{"$f":"IF(E917=\"\",\"\",VLOOKUP(E917,Treinamentos!$B$13:$G$42,5,0))","v":""},null,null,null,null,null,{"$f":"IF(E917=\"\",\"\",VLOOKUP(E917,Treinamentos!$B$13:$G$42,6,0))","v":""}]
[null,null,{"$f":"IF(B918=\"\",\"\",VLOOKUP(B918,Colab!$C$14:$E$63,2,0))","v":""},{"$f":"IF(B918=\"\",\"\",VLOOKUP(B918,Colab!$C$14:$E$63,3,0))","v":""},null,{"$f":"IF(E918=\"\",\"\",VLOOKUP(E918,Treinamentos!$B$13:$G$42,5,0))","v":""},null,null,null,null,null,{"$f":"IF(E918=\"\",\"\",VLOOKUP(E918,Treinamentos!$B$13:$G$42,6,0))","v":""}]
[null,null,{"$f":"IF(B919=\"\",\"\",VLOOKUP(B919,Colab!$C$14:$E$63,2,0))","v":""},{"$f":"IF(B919=\"\",\"\",VLOOKUP(B919,Colab!$C$14:$E$63,3,0))","v":""},null,{"$f":"IF(E919=\"\",\"\",VLOOKUP(E919,Treinamentos!$B$13:$G$42,5,0))","v":""},null,null,null,null,null,{"$f":"IF(E919=\"\",\"\",VLOOKUP(E919,Treinamentos!$B$13:$G$42,6,0))","v":""}]
[null,null,{"$f":"IF(B920=\"\",\"\",VLOOKUP(B920,Colab!$C$14:$E$63,2,0))","v":""},{"$f":"IF(B920=\"\",\"\",VLOOKUP(B920,Colab!$C$14:$E$63,3,0))","v":""},null,{"$f":"IF(E920=\"\",\"\",VLOOKUP(E920,Treinamentos!$B$13:$G$42,5,0))","v":""},null,null,null,null,null,{"$f":"IF(E920=\"\",\"\",VLOOKUP(E920,Treinamentos!$B$13:$G$42,6,0))","v":""}]
[null,null,{"$f":"IF(B921=\"\",\"\",VLOOKUP(B921,Colab!$C$14:$E$63,2,0))","v":""},{"$f":"IF(B921=\"\",\"\",VLOOKUP(B921,Colab!$C$14:$E$63,3,0))","v":""},null,{"$f":"IF(E921=\"\",\"\",VLOOKUP(E921,Treinamentos!$B$13:$G$42,5,0))","v":""},null,null,null,null,null,{"$f":"IF(E921=\"\",\"\",VLOOKUP(E921,Treinamentos!$B$13:$G$42,6,0))","v":""}]
[null,null,{"$f":"IF(B922=\"\",\"\",VLOOKUP(B922,Colab!$C$14:$E$63,2,0))","v":""},{"$f":"IF(B922=\"\",\"\",VLOOKUP(B922,Colab!$C$14:$E$63,3,0))","v":""},null,{"$f":"IF(E922=\"\",\"\",VLOOKUP(E922,Treinamentos!$B$13:$G$42,5,0))","v":""},null,null,null,null,null,{"$f":"IF(E922=\"\",\"\",VLOOKUP(E922,Treinamentos!$B$13:$G$42,6,0))","v":""}]
[null,null,{"$f":"IF(B923=\"\",\"\",VLOOKUP(B923,Colab!$C$14:$E$63,2,0))","v":""},{"$f":"IF(B923=\"\",\"\",VLOOKUP(B923,Colab!$C$14:$E$63,3,0))","v":""},null,{"$f":"IF(E923=\"\",\"\",VLOOKUP(E923,Treinamentos!$B$13:$G$42,5,0))","v":""},null,null,null,null,null,{"$f":"IF(E923=\"\",\"\",VLOOKUP(E923,Treinamentos!$B$13:$G$42,6,0))","v":""}]
[null,null,{"$f":"IF(B924=\"\",\"\",VLOOKUP(B924,Colab!$C$14:$E$63,2,0))","v":""},{"$f":"IF(B924=\"\",\"\",VLOOKUP(B924,Colab!$C$14:$E$63,3,0))","v":""},null,{"$f":"IF(E924=\"\",\"\",VLOOKUP(E924,Treinamentos!$B$13:$G$42,5,0))","v":""},null,null,null,null,null,{"$f":"IF(E924=\"\",\"\",VLOOKUP(E924,Treinamentos!$B$13:$G$42,6,0))","v":""}]
[null,null,{"$f":"IF(B925=\"\",\"\",VLOOKUP(B925,Colab!$C$14:$E$63,2,0))","v":""},{"$f":"IF(B925=\"\",\"\",VLOOKUP(B925,Colab!$C$14:$E$63,3,0))","v":""},null,{"$f":"IF(E925=\"\",\"\",VLOOKUP(E925,Treinamentos!$B$13:$G$42,5,0))","v":""},null,null,null,null,null,{"$f":"IF(E925=\"\",\"\",VLOOKUP(E925,Treinamentos!$B$13:$G$42,6,0))","v":""}]
[null,null,{"$f":"IF(B926=\"\",\"\",VLOOKUP(B926,Colab!$C$14:$E$63,2,0))","v":""},{"$f":"IF(B926=\"\",\"\",VLOOKUP(B926,Colab!$C$14:$E$63,3,0))","v":""},null,{"$f":"IF(E926=\"\",\"\",VLOOKUP(E926,Treinamentos!$B$13:$G$42,5,0))","v":""},null,null,null,null,null,{"$f":"IF(E926=\"\",\"\",VLOOKUP(E926,Treinamentos!$B$13:$G$42,6,0))","v":""}]
[null,null,{"$f":"IF(B927=\"\",\"\",VLOOKUP(B927,Colab!$C$14:$E$63,2,0))","v":""},{"$f":"IF(B927=\"\",\"\",VLOOKUP(B927,Colab!$C$14:$E$63,3,0))","v":""},null,{"$f":"IF(E927=\"\",\"\",VLOOKUP(E927,Treinamentos!$B$13:$G$42,5,0))","v":""},null,null,null,null,null,{"$f":"IF(E927=\"\",\"\",VLOOKUP(E927,Treinamentos!$B$13:$G$42,6,0))","v":""}]
[null,null,{"$f":"IF(B928=\"\",\"\",VLOOKUP(B928,Colab!$C$14:$E$63,2,0))","v":""},{"$f":"IF(B928=\"\",\"\",VLOOKUP(B928,Colab!$C$14:$E$63,3,0))","v":""},null,{"$f":"IF(E928=\"\",\"\",VLOOKUP(E928,Treinamentos!$B$13:$G$42,5,0))","v":""},null,null,null,null,null,{"$f":"IF(E928=\"\",\"\",VLOOKUP(E928,Treinamentos!$B$13:$G$42,6,0))","v":""}]
[null,null,{"$f":"IF(B929=\"\",\"\",VLOOKUP(B929,Colab!$C$14:$E$63,2,0))","v":""},{"$f":"IF(B929=\"\",\"\",VLOOKUP(B929,Colab!$C$14:$E$63,3,0))","v":""},null,{"$f":"IF(E929=\"\",\"\",VLOOKUP(E929,Treinamentos!$B$13:$G$42,5,0))","v":""},null,null,null,null,null,{"$f":"IF(E929=\"\",\"\",VLOOKUP(E929,Treinamentos!$B$13:$G$42,6,0))","v":""}]
[null,null,{"$f":"IF(B930=\"\",\"\",VLOOKUP(B930,Colab!$C$14:$E$63,2,0))","v":""},{"$f":"IF(B930=\"\",\"\",VLOOKUP(B930,Colab!$C$14:$E$63,3,0))","v":""},null,{"$f":"IF(E930=\"\",\"\",VLOOKUP(E930,Treinamentos!$B$13:$G$42,5,0))","v":""},null,null,null,null,null,{"$f":"IF(E930=\"\",\"\",VLOOKUP(E930,Treinamentos!$B$13:$G$42,6,0))","v":""}]
[null,null,{"$f":"IF(B931=\"\",\"\",VLOOKUP(B931,Colab!$C$14:$E$63,2,0))","v":""},{"$f":"IF(B931=\"\",\"\",VLOOKUP(B931,Colab!$C$14:$E$63,3,0))","v":""},null,{"$f":"IF(E931=\"\",\"\",VLOOKUP(E931,Treinamentos!$B$13:$G$42,5,0))","v":""},null,null,null,null,null,{"$f":"IF(E931=\"\",\"\",VLOOKUP(E931,Treinamentos!$B$13:$G$42,6,0))","v":""}]
[null,null,{"$f":"IF(B932=\"\",\"\",VLOOKUP(B932,Colab!$C$14:$E$63,2,0))","v":""},{"$f":"IF(B932=\"\",\"\",VLOOKUP(B932,Colab!$C$14:$E$63,3,0))","v":""},null,{"$f":"IF(E932=\"\",\"\",VLOOKUP(E932,Treinamentos!$B$13:$G$42,5,0))","v":""},null,null,null,null,null,{"$f":"IF(E932=\"\",\"\",VLOOKUP(E932,Treinamentos!$B$13:$G$42,6,0))","v":""}]
[null,null,{"$f":"IF(B933=\"\",\"\",VLOOKUP(B933,Colab!$C$14:$E$63,2,0))","v":""},{"$f":"IF(B933=\"\",\"\",VLOOKUP(B933,Colab!$C$14:$E$63,3,0))","v":""},null,{"$f":"IF(E933=\"\",\"\",VLOOKUP(E933,Treinamentos!$B$13:$G$42,5,0))","v":""},null,null,null,null,null,{"$f":"IF(E933=\"\",\"\",VLOOKUP(E933,Treinamentos!$B$13:$G$42,6,0))","v":""}]
[null,null,{"$f":"IF(B934=\"\",\"\",VLOOKUP(B934,Colab!$C$14:$E$63,2,0))","v":""},{"$f":"IF(B934=\"\",\"\",VLOOKUP(B934,Colab!$C$14:$E$63,3,0))","v":""},null,{"$f":"IF(E934=\"\",\"\",VLOOKUP(E934,Treinamentos!$B$13:$G$42,5,0))","v":""},null,null,null,null,null,{"$f":"IF(E934=\"\",\"\",VLOOKUP(E934,Treinamentos!$B$13:$G$42,6,0))","v":""}]
[null,null,{"$f":"IF(B935=\"\",\"\",VLOOKUP(B935,Colab!$C$14:$E$63,2,0))","v":""},{"$f":"IF(B935=\"\",\"\",VLOOKUP(B935,Colab!$C$14:$E$63,3,0))","v":""},null,{"$f":"IF(E935=\"\",\"\",VLOOKUP(E935,Treinamentos!$B$13:$G$42,5,0))","v":""},null,null,null,null,null,{"$f":"IF(E935=\"\",\"\",VLOOKUP(E935,Treinamentos!$B$13:$G$42,6,0))","v":""}]
[null,null,{"$f":"IF(B936=\"\",\"\",VLOOKUP(B936,Colab!$C$14:$E$63,2,0))","v":""},{"$f":"IF(B936=\"\",\"\",VLOOKUP(B936,Colab!$C$14:$E$63,3,0))","v":""},null,{"$f":"IF(E936=\"\",\"\",VLOOKUP(E936,Treinamentos!$B$13:$G$42,5,0))","v":""},null,null,null,null,null,{"$f":"IF(E936=\"\",\"\",VLOOKUP(E936,Treinamentos!$B$13:$G$42,6,0))","v":""}]
[null,null,{"$f":"IF(B937=\"\",\"\",VLOOKUP(B937,Colab!$C$14:$E$63,2,0))","v":""},{"$f":"IF(B937=\"\",\"\",VLOOKUP(B937,Colab!$C$14:$E$63,3,0))","v":""},null,{"$f":"IF(E937=\"\",\"\",VLOOKUP(E937,Treinamentos!$B$13:$G$42,5,0))","v":""},null,null,null,null,null,{"$f":"IF(E937=\"\",\"\",VLOOKUP(E937,Treinamentos!$B$13:$G$42,6,0))","v":""}]
[null,null,{"$f":"IF(B938=\"\",\"\",VLOOKUP(B938,Colab!$C$14:$E$63,2,0))","v":""},{"$f":"IF(B938=\"\",\"\",VLOOKUP(B938,Colab!$C$14:$E$63,3,0))","v":""},null,{"$f":"IF(E938=\"\",\"\",VLOOKUP(E938,Treinamentos!$B$13:$G$42,5,0))","v":""},null,null,null,null,null,{"$f":"IF(E938=\"\",\"\",VLOOKUP(E938,Treinamentos!$B$13:$G$42,6,0))","v":""}]
[null,null,{"$f":"IF(B939=\"\",\"\",VLOOKUP(B939,Colab!$C$14:$E$63,2,0))","v":""},{"$f":"IF(B939=\"\",\"\",VLOOKUP(B939,Colab!$C$14:$E$63,3,0))","v":""},null,{"$f":"IF(E939=\"\",\"\",VLOOKUP(E939,Treinamentos!$B$13:$G$42,5,0))","v":""},null,null,null,null,null,{"$f":"IF(E939=\"\",\"\",VLOOKUP(E939,Treinamentos!$B$13:$G$42,6,0))","v":""}]
[null,null,{"$f":"IF(B940=\"\",\"\",VLOOKUP(B940,Colab!$C$14:$E$63,2,0))","v":""},{"$f":"IF(B940=\"\",\"\",VLOOKUP(B940,Colab!$C$14:$E$63,3,0))","v":""},null,{"$f":"IF(E940=\"\",\"\",VLOOKUP(E940,Treinamentos!$B$13:$G$42,5,0))","v":""},null,null,null,null,null,{"$f":"IF(E940=\"\",\"\",VLOOKUP(E940,Treinamentos!$B$13:$G$42,6,0))","v":""}]
[null,null,{"$f":"IF(B941=\"\",\"\",VLOOKUP(B941,Colab!$C$14:$E$63,2,0))","v":""},{"$f":"IF(B941=\"\",\"\",VLOOKUP(B941,Colab!$C$14:$E$63,3,0))","v":""},null,{"$f":"IF(E941=\"\",\"\",VLOOKUP(E941,Treinamentos!$B$13:$G$42,5,0))","v":""},null,null,null,null,null,{"$f":"IF(E941=\"\",\"\",VLOOKUP(E941,Treinamentos!$B$13:$G$42,6,0))","v":""}]
[null,null,{"$f":"IF(B942=\"\",\"\",VLOOKUP(B942,Colab!$C$14:$E$63,2,0))","v":""},{"$f":"IF(B942=\"\",\"\",VLOOKUP(B942,Colab!$C$14:$E$63,3,0))","v":""},null,{"$f":"IF(E942=\"\",\"\",VLOOKUP(E942,Treinamentos!$B$13:$G$42,5,0))","v":""},null,null,null,null,null,{"$f":"IF(E942=\"\",\"\",VLOOKUP(E942,Treinamentos!$B$13:$G$42,6,0))","v":""}]
[null,null,{"$f":"IF(B943=\"\",\"\",VLOOKUP(B943,Colab!$C$14:$E$63,2,0))","v":""},{"$f":"IF(B943=\"\",\"\",VLOOKUP(B943,Colab!$C$14:$E$63,3,0))","v":""},null,{"$f":"IF(E943=\"\",\"\",VLOOKUP(E943,Treinamentos!$B$13:$G$42,5,0))","v":""},null,null,null,null,null,{"$f":"IF(E943=\"\",\"\",VLOOKUP(E943,Treinamentos!$B$13:$G$42,6,0))","v":""}]
[null,null,{"$f":"IF(B944=\"\",\"\",VLOOKUP(B944,Colab!$C$14:$E$63,2,0))","v":""},{"$f":"IF(B944=\"\",\"\",VLOOKUP(B944,Colab!$C$14:$E$63,3,0))","v":""},null,{"$f":"IF(E944=\"\",\"\",VLOOKUP(E944,Treinamentos!$B$13:$G$42,5,0))","v":""},null,null,null,null,null,{"$f":"IF(E944=\"\",\"\",VLOOKUP(E944,Treinamentos!$B$13:$G$42,6,0))","v":""}]
[null,null,{"$f":"IF(B945=\"\",\"\",VLOOKUP(B945,Colab!$C$14:$E$63,2,0))","v":""},{"$f":"IF(B945=\"\",\"\",VLOOKUP(B945,Colab!$C$14:$E$63,3,0))","v":""},null,{"$f":"IF(E945=\"\",\"\",VLOOKUP(E945,Treinamentos!$B$13:$G$42,5,0))","v":""},null,null,null,null,null,{"$f":"IF(E945=\"\",\"\",VLOOKUP(E945,Treinamentos!$B$13:$G$42,6,0))","v":""}]
[null,null,{"$f":"IF(B946=\"\",\"\",VLOOKUP(B946,Colab!$C$14:$E$63,2,0))","v":""},{"$f":"IF(B946=\"\",\"\",VLOOKUP(B946,Colab!$C$14:$E$63,3,0))","v":""},null,{"$f":"IF(E946=\"\",\"\",VLOOKUP(E946,Treinamentos!$B$13:$G$42,5,0))","v":""},null,null,null,null,null,{"$f":"IF(E946=\"\",\"\",VLOOKUP(E946,Treinamentos!$B$13:$G$42,6,0))","v":""}]
[null,null,{"$f":"IF(B947=\"\",\"\",VLOOKUP(B947,Colab!$C$14:$E$63,2,0))","v":""},{"$f":"IF(B947=\"\",\"\",VLOOKUP(B947,Colab!$C$14:$E$63,3,0))","v":""},null,{"$f":"IF(E947=\"\",\"\",VLOOKUP(E947,Treinamentos!$B$13:$G$42,5,0))","v":""},null,null,null,null,null,{"$f":"IF(E947=\"\",\"\",VLOOKUP(E947,Treinamentos!$B$13:$G$42,6,0))","v":""}]
[null,null,{"$f":"IF(B948=\"\",\"\",VLOOKUP(B948,Colab!$C$14:$E$63,2,0))","v":""},{"$f":"IF(B948=\"\",\"\",VLOOKUP(B948,Colab!$C$14:$E$63,3,0))","v":""},null,{"$f":"IF(E948=\"\",\"\",VLOOKUP(E948,Treinamentos!$B$13:$G$42,5,0))","v":""},null,null,null,null,null,{"$f":"IF(E948=\"\",\"\",VLOOKUP(E948,Treinamentos!$B$13:$G$42,6,0))","v":""}]
[null,null,{"$f":"IF(B949=\"\",\"\",VLOOKUP(B949,Colab!$C$14:$E$63,2,0))","v":""},{"$f":"IF(B949=\"\",\"\",VLOOKUP(B949,Colab!$C$14:$E$63,3,0))","v":""},null,{"$f":"IF(E949=\"\",\"\",VLOOKUP(E949,Treinamentos!$B$13:$G$42,5,0))","v":""},null,null,null,null,null,{"$f":"IF(E949=\"\",\"\",VLOOKUP(E949,Treinamentos!$B$13:$G$42,6,0))","v":""}]
[null,null,{"$f":"IF(B950=\"\",\"\",VLOOKUP(B950,Colab!$C$14:$E$63,2,0))","v":""},{"$f":"IF(B950=\"\",\"\",VLOOKUP(B950,Colab!$C$14:$E$63,3,0))","v":""},null,{"$f":"IF(E950=\"\",\"\",VLOOKUP(E950,Treinamentos!$B$13:$G$42,5,0))","v":""},null,null,null,null,null,{"$f":"IF(E950=\"\",\"\",VLOOKUP(E950,Treinamentos!$B$13:$G$42,6,0))","v":""}]
[null,null,{"$f":"IF(B951=\"\",\"\",VLOOKUP(B951,Colab!$C$14:$E$63,2,0))","v":""},{"$f":"IF(B951=\"\",\"\",VLOOKUP(B951,Colab!$C$14:$E$63,3,0))","v":""},null,{"$f":"IF(E951=\"\",\"\",VLOOKUP(E951,Treinamentos!$B$13:$G$42,5,0))","v":""},null,null,null,null,null,{"$f":"IF(E951=\"\",\"\",VLOOKUP(E951,Treinamentos!$B$13:$G$42,6,0))","v":""}]
[null,null,{"$f":"IF(B952=\"\",\"\",VLOOKUP(B952,Colab!$C$14:$E$63,2,0))","v":""},{"$f":"IF(B952=\"\",\"\",VLOOKUP(B952,Colab!$C$14:$E$63,3,0))","v":""},null,{"$f":"IF(E952=\"\",\"\",VLOOKUP(E952,Treinamentos!$B$13:$G$42,5,0))","v":""},null,null,null,null,null,{"$f":"IF(E952=\"\",\"\",VLOOKUP(E952,Treinamentos!$B$13:$G$42,6,0))","v":""}]
[null,null,{"$f":"IF(B953=\"\",\"\",VLOOKUP(B953,Colab!$C$14:$E$63,2,0))","v":""},{"$f":"IF(B953=\"\",\"\",VLOOKUP(B953,Colab!$C$14:$E$63,3,0))","v":""},null,{"$f":"IF(E953=\"\",\"\",VLOOKUP(E953,Treinamentos!$B$13:$G$42,5,0))","v":""},null,null,null,null,null,{"$f":"IF(E953=\"\",\"\",VLOOKUP(E953,Treinamentos!$B$13:$G$42,6,0))","v":""}]
[null,null,{"$f":"IF(B954=\"\",\"\",VLOOKUP(B954,Colab!$C$14:$E$63,2,0))","v":""},{"$f":"IF(B954=\"\",\"\",VLOOKUP(B954,Colab!$C$14:$E$63,3,0))","v":""},null,{"$f":"IF(E954=\"\",\"\",VLOOKUP(E954,Treinamentos!$B$13:$G$42,5,0))","v":""},null,null,null,null,null,{"$f":"IF(E954=\"\",\"\",VLOOKUP(E954,Treinamentos!$B$13:$G$42,6,0))","v":""}]
[null,null,{"$f":"IF(B955=\"\",\"\",VLOOKUP(B955,Colab!$C$14:$E$63,2,0))","v":""},{"$f":"IF(B955=\"\",\"\",VLOOKUP(B955,Colab!$C$14:$E$63,3,0))","v":""},null,{"$f":"IF(E955=\"\",\"\",VLOOKUP(E955,Treinamentos!$B$13:$G$42,5,0))","v":""},null,null,null,null,null,{"$f":"IF(E955=\"\",\"\",VLOOKUP(E955,Treinamentos!$B$13:$G$42,6,0))","v":""}]
[null,null,{"$f":"IF(B956=\"\",\"\",VLOOKUP(B956,Colab!$C$14:$E$63,2,0))","v":""},{"$f":"IF(B956=\"\",\"\",VLOOKUP(B956,Colab!$C$14:$E$63,3,0))","v":""},null,{"$f":"IF(E956=\"\",\"\",VLOOKUP(E956,Treinamentos!$B$13:$G$42,5,0))","v":""},null,null,null,null,null,{"$f":"IF(E956=\"\",\"\",VLOOKUP(E956,Treinamentos!$B$13:$G$42,6,0))","v":""}]
[null,null,{"$f":"IF(B957=\"\",\"\",VLOOKUP(B957,Colab!$C$14:$E$63,2,0))","v":""},{"$f":"IF(B957=\"\",\"\",VLOOKUP(B957,Colab!$C$14:$E$63,3,0))","v":""},null,{"$f":"IF(E957=\"\",\"\",VLOOKUP(E957,Treinamentos!$B$13:$G$42,5,0))","v":""},null,null,null,null,null,{"$f":"IF(E957=\"\",\"\",VLOOKUP(E957,Treinamentos!$B$13:$G$42,6,0))","v":""}]
[null,null,{"$f":"IF(B958=\"\",\"\",VLOOKUP(B958,Colab!$C$14:$E$63,2,0))","v":""},{"$f":"IF(B958=\"\",\"\",VLOOKUP(B958,Colab!$C$14:$E$63,3,0))","v":""},null,{"$f":"IF(E958=\"\",\"\",VLOOKUP(E958,Treinamentos!$B$13:$G$42,5,0))","v":""},null,null,null,null,null,{"$f":"IF(E958=\"\",\"\",VLOOKUP(E958,Treinamentos!$B$13:$G$42,6,0))","v":""}]
[null,null,{"$f":"IF(B959=\"\",\"\",VLOOKUP(B959,Colab!$C$14:$E$63,2,0))","v":""},{"$f":"IF(B959=\"\",\"\",VLOOKUP(B959,Colab!$C$14:$E$63,3,0))","v":""},null,{"$f":"IF(E959=\"\",\"\",VLOOKUP(E959,Treinamentos!$B$13:$G$42,5,0))","v":""},null,null,null,null,null,{"$f":"IF(E959=\"\",\"\",VLOOKUP(E959,Treinamentos!$B$13:$G$42,6,0))","v":""}]
[null,null,{"$f":"IF(B960=\"\",\"\",VLOOKUP(B960,Colab!$C$14:$E$63,2,0))","v":""},{"$f":"IF(B960=\"\",\"\",VLOOKUP(B960,Colab!$C$14:$E$63,3,0))","v":""},null,{"$f":"IF(E960=\"\",\"\",VLOOKUP(E960,Treinamentos!$B$13:$G$42,5,0))","v":""},null,null,null,null,null,{"$f":"IF(E960=\"\",\"\",VLOOKUP(E960,Treinamentos!$B$13:$G$42,6,0))","v":""}]
[null,null,{"$f":"IF(B961=\"\",\"\",VLOOKUP(B961,Colab!$C$14:$E$63,2,0))","v":""},{"$f":"IF(B961=\"\",\"\",VLOOKUP(B961,Colab!$C$14:$E$63,3,0))","v":""},null,{"$f":"IF(E961=\"\",\"\",VLOOKUP(E961,Treinamentos!$B$13:$G$42,5,0))","v":""},null,null,null,null,null,{"$f":"IF(E961=\"\",\"\",VLOOKUP(E961,Treinamentos!$B$13:$G$42,6,0))","v":""}]
[null,null,{"$f":"IF(B962=\"\",\"\",VLOOKUP(B962,Colab!$C$14:$E$63,2,0))","v":""},{"$f":"IF(B962=\"\",\"\",VLOOKUP(B962,Colab!$C$14:$E$63,3,0))","v":""},null,{"$f":"IF(E962=\"\",\"\",VLOOKUP(E962,Treinamentos!$B$13:$G$42,5,0))","v":""},null,null,null,null,null,{"$f":"IF(E962=\"\",\"\",VLOOKUP(E962,Treinamentos!$B$13:$G$42,6,0))","v":""}]
[null,null,{"$f":"IF(B963=\"\",\"\",VLOOKUP(B963,Colab!$C$14:$E$63,2,0))","v":""},{"$f":"IF(B963=\"\",\"\",VLOOKUP(B963,Colab!$C$14:$E$63,3,0))","v":""},null,{"$f":"IF(E963=\"\",\"\",VLOOKUP(E963,Treinamentos!$B$13:$G$42,5,0))","v":""},null,null,null,null,null,{"$f":"IF(E963=\"\",\"\",VLOOKUP(E963,Treinamentos!$B$13:$G$42,6,0))","v":""}]
[null,null,{"$f":"IF(B964=\"\",\"\",VLOOKUP(B964,Colab!$C$14:$E$63,2,0))","v":""},{"$f":"IF(B964=\"\",\"\",VLOOKUP(B964,Colab!$C$14:$E$63,3,0))","v":""},null,{"$f":"IF(E964=\"\",\"\",VLOOKUP(E964,Treinamentos!$B$13:$G$42,5,0))","v":""},null,null,null,null,null,{"$f":"IF(E964=\"\",\"\",VLOOKUP(E964,Treinamentos!$B$13:$G$42,6,0))","v":""}]
[null,null,{"$f":"IF(B965=\"\",\"\",VLOOKUP(B965,Colab!$C$14:$E$63,2,0))","v":""},{"$f":"IF(B965=\"\",\"\",VLOOKUP(B965,Colab!$C$14:$E$63,3,0))","v":""},null,{"$f":"IF(E965=\"\",\"\",VLOOKUP(E965,Treinamentos!$B$13:$G$42,5,0))","v":""},null,null,null,null,null,{"$f":"IF(E965=\"\",\"\",VLOOKUP(E965,Treinamentos!$B$13:$G$42,6,0))","v":""}]
[null,null,{"$f":"IF(B966=\"\",\"\",VLOOKUP(B966,Colab!$C$14:$E$63,2,0))","v":""},{"$f":"IF(B966=\"\",\"\",VLOOKUP(B966,Colab!$C$14:$E$63,3,0))","v":""},null,{"$f":"IF(E966=\"\",\"\",VLOOKUP(E966,Treinamentos!$B$13:$G$42,5,0))","v":""},null,null,null,null,null,{"$f":"IF(E966=\"\",\"\",VLOOKUP(E966,Treinamentos!$B$13:$G$42,6,0))","v":""}]
[null,null,{"$f":"IF(B967=\"\",\"\",VLOOKUP(B967,Colab!$C$14:$E$63,2,0))","v":""},{"$f":"IF(B967=\"\",\"\",VLOOKUP(B967,Colab!$C$14:$E$63,3,0))","v":""},null,{"$f":"IF(E967=\"\",\"\",VLOOKUP(E967,Treinamentos!$B$13:$G$42,5,0))","v":""},null,null,null,null,null,{"$f":"IF(E967=\"\",\"\",VLOOKUP(E967,Treinamentos!$B$13:$G$42,6,0))","v":""}]
[null,null,{"$f":"IF(B968=\"\",\"\",VLOOKUP(B968,Colab!$C$14:$E$63,2,0))","v":""},{"$f":"IF(B968=\"\",\"\",VLOOKUP(B968,Colab!$C$14:$E$63,3,0))","v":""},null,{"$f":"IF(E968=\"\",\"\",VLOOKUP(E968,Treinamentos!$B$13:$G$42,5,0))","v":""},null,null,null,null,null,{"$f":"IF(E968=\"\",\"\",VLOOKUP(E968,Treinamentos!$B$13:$G$42,6,0))","v":""}]
[null,null,{"$f":"IF(B969=\"\",\"\",VLOOKUP(B969,Colab!$C$14:$E$63,2,0))","v":""},{"$f":"IF(B969=\"\",\"\",VLOOKUP(B969,Colab!$C$14:$E$63,3,0))","v":""},null,{"$f":"IF(E969=\"\",\"\",VLOOKUP(E969,Treinamentos!$B$13:$G$42,5,0))","v":""},null,null,null,null,null,{"$f":"IF(E969=\"\",\"\",VLOOKUP(E969,Treinamentos!$B$13:$G$42,6,0))","v":""}]
[null,null,{"$f":"IF(B970=\"\",\"\",VLOOKUP(B970,Colab!$C$14:$E$63,2,0))","v":""},{"$f":"IF(B970=\"\",\"\",VLOOKUP(B970,Colab!$C$14:$E$63,3,0))","v":""},null,{"$f":"IF(E970=\"\",\"\",VLOOKUP(E970,Treinamentos!$B$13:$G$42,5,0))","v":""},null,null,null,null,null,{"$f":"IF(E970=\"\",\"\",VLOOKUP(E970,Treinamentos!$B$13:$G$42,6,0))","v":""}]
[null,null,{"$f":"IF(B971=\"\",\"\",VLOOKUP(B971,Colab!$C$14:$E$63,2,0))","v":""},{"$f":"IF(B971=\"\",\"\",VLOOKUP(B971,Colab!$C$14:$E$63,3,0))","v":""},null,{"$f":"IF(E971=\"\",\"\",VLOOKUP(E971,Treinamentos!$B$13:$G$42,5,0))","v":""},null,null,null,null,null,{"$f":"IF(E971=\"\",\"\",VLOOKUP(E971,Treinamentos!$B$13:$G$42,6,0))","v":""}]
[null,null,{"$f":"IF(B972=\"\",\"\",VLOOKUP(B972,Colab!$C$14:$E$63,2,0))","v":""},{"$f":"IF(B972=\"\",\"\",VLOOKUP(B972,Colab!$C$14:$E$63,3,0))","v":""},null,{"$f":"IF(E972=\"\",\"\",VLOOKUP(E972,Treinamentos!$B$13:$G$42,5,0))","v":""},null,null,null,null,null,{"$f":"IF(E972=\"\",\"\",VLOOKUP(E972,Treinamentos!$B$13:$G$42,6,0))","v":""}]
[null,null,{"$f":"IF(B973=\"\",\"\",VLOOKUP(B973,Colab!$C$14:$E$63,2,0))","v":""},{"$f":"IF(B973=\"\",\"\",VLOOKUP(B973,Colab!$C$14:$E$63,3,0))","v":""},null,{"$f":"IF(E973=\"\",\"\",VLOOKUP(E973,Treinamentos!$B$13:$G$42,5,0))","v":""},null,null,null,null,null,{"$f":"IF(E973=\"\",\"\",VLOOKUP(E973,Treinamentos!$B$13:$G$42,6,0))","v":""}]
[null,null,{"$f":"IF(B974=\"\",\"\",VLOOKUP(B974,Colab!$C$14:$E$63,2,0))","v":""},{"$f":"IF(B974=\"\",\"\",VLOOKUP(B974,Colab!$C$14:$E$63,3,0))","v":""},null,{"$f":"IF(E974=\"\",\"\",VLOOKUP(E974,Treinamentos!$B$13:$G$42,5,0))","v":""},null,null,null,null,null,{"$f":"IF(E974=\"\",\"\",VLOOKUP(E974,Treinamentos!$B$13:$G$42,6,0))","v":""}]
[null,null,{"$f":"IF(B975=\"\",\"\",VLOOKUP(B975,Colab!$C$14:$E$63,2,0))","v":""},{"$f":"IF(B975=\"\",\"\",VLOOKUP(B975,Colab!$C$14:$E$63,3,0))","v":""},null,{"$f":"IF(E975=\"\",\"\",VLOOKUP(E975,Treinamentos!$B$13:$G$42,5,0))","v":""},null,null,null,null,null,{"$f":"IF(E975=\"\",\"\",VLOOKUP(E975,Treinamentos!$B$13:$G$42,6,0))","v":""}]
[null,null,{"$f":"IF(B976=\"\",\"\",VLOOKUP(B976,Colab!$C$14:$E$63,2,0))","v":""},{"$f":"IF(B976=\"\",\"\",VLOOKUP(B976,Colab!$C$14:$E$63,3,0))","v":""},null,{"$f":"IF(E976=\"\",\"\",VLOOKUP(E976,Treinamentos!$B$13:$G$42,5,0))","v":""},null,null,null,null,null,{"$f":"IF(E976=\"\",\"\",VLOOKUP(E976,Treinamentos!$B$13:$G$42,6,0))","v":""}]
[null,null,{"$f":"IF(B977=\"\",\"\",VLOOKUP(B977,Colab!$C$14:$E$63,2,0))","v":""},{"$f":"IF(B977=\"\",\"\",VLOOKUP(B977,Colab!$C$14:$E$63,3,0))","v":""},null,{"$f":"IF(E977=\"\",\"\",VLOOKUP(E977,Treinamentos!$B$13:$G$42,5,0))","v":""},null,null,null,null,null,{"$f":"IF(E977=\"\",\"\",VLOOKUP(E977,Treinamentos!$B$13:$G$42,6,0))","v":""}]
[null,null,{"$f":"IF(B978=\"\",\"\",VLOOKUP(B978,Colab!$C$14:$E$63,2,0))","v":""},{"$f":"IF(B978=\"\",\"\",VLOOKUP(B978,Colab!$C$14:$E$63,3,0))","v":""},null,{"$f":"IF(E978=\"\",\"\",VLOOKUP(E978,Treinamentos!$B$13:$G$42,5,0))","v":""},null,null,null,null,null,{"$f":"IF(E978=\"\",\"\",VLOOKUP(E978,Treinamentos!$B$13:$G$42,6,0))","v":""}]
[null,null,{"$f":"IF(B979=\"\",\"\",VLOOKUP(B979,Colab!$C$14:$E$63,2,0))","v":""},{"$f":"IF(B979=\"\",\"\",VLOOKUP(B979,Colab!$C$14:$E$63,3,0))","v":""},null,{"$f":"IF(E979=\"\",\"\",VLOOKUP(E979,Treinamentos!$B$13:$G$42,5,0))","v":""},null,null,null,null,null,{"$f":"IF(E979=\"\",\"\",VLOOKUP(E979,Treinamentos!$B$13:$G$42,6,0))","v":""}]
[null,null,{"$f":"IF(B980=\"\",\"\",VLOOKUP(B980,Colab!$C$14:$E$63,2,0))","v":""},{"$f":"IF(B980=\"\",\"\",VLOOKUP(B980,Colab!$C$14:$E$63,3,0))","v":""},null,{"$f":"IF(E980=\"\",\"\",VLOOKUP(E980,Treinamentos!$B$13:$G$42,5,0))","v":""},null,null,null,null,null,{"$f":"IF(E980=\"\",\"\",VLOOKUP(E980,Treinamentos!$B$13:$G$42,6,0))","v":""}]
[null,null,{"$f":"IF(B981=\"\",\"\",VLOOKUP(B981,Colab!$C$14:$E$63,2,0))","v":""},{"$f":"IF(B981=\"\",\"\",VLOOKUP(B981,Colab!$C$14:$E$63,3,0))","v":""},null,{"$f":"IF(E981=\"\",\"\",VLOOKUP(E981,Treinamentos!$B$13:$G$42,5,0))","v":""},null,null,null,null,null,{"$f":"IF(E981=\"\",\"\",VLOOKUP(E981,Treinamentos!$B$13:$G$42,6,0))","v":""}]
[null,null,{"$f":"IF(B982=\"\",\"\",VLOOKUP(B982,Colab!$C$14:$E$63,2,0))","v":""},{"$f":"IF(B982=\"\",\"\",VLOOKUP(B982,Colab!$C$14:$E$63,3,0))","v":""},null,{"$f":"IF(E982=\"\",\"\",VLOOKUP(E982,Treinamentos!$B$13:$G$42,5,0))","v":""},null,null,null,null,null,{"$f":"IF(E982=\"\",\"\",VLOOKUP(E982,Treinamentos!$B$13:$G$42,6,0))","v":""}]
[null,null,{"$f":"IF(B983=\"\",\"\",VLOOKUP(B983,Colab!$C$14:$E$63,2,0))","v":""},{"$f":"IF(B983=\"\",\"\",VLOOKUP(B983,Colab!$C$14:$E$63,3,0))","v":""},null,{"$f":"IF(E983=\"\",\"\",VLOOKUP(E983,Treinamentos!$B$13:$G$42,5,0))","v":""},null,null,null,null,null,{"$f":"IF(E983=\"\",\"\",VLOOKUP(E983,Treinamentos!$B$13:$G$42,6,0))","v":""}]
[null,null,{"$f":"IF(B984=\"\",\"\",VLOOKUP(B984,Colab!$C$14:$E$63,2,0))","v":""},{"$f":"IF(B984=\"\",\"\",VLOOKUP(B984,Colab!$C$14:$E$63,3,0))","v":""},null,{"$f":"IF(E984=\"\",\"\",VLOOKUP(E984,Treinamentos!$B$13:$G$42,5,0))","v":""},null,null,null,null,null,{"$f":"IF(E984=\"\",\"\",VLOOKUP(E984,Treinamentos!$B$13:$G$42,6,0))","v":""}]
[null,null,{"$f":"IF(B985=\"\",\"\",VLOOKUP(B985,Colab!$C$14:$E$63,2,0))","v":""},{"$f":"IF(B985=\"\",\"\",VLOOKUP(B985,Colab!$C$14:$E$63,3,0))","v":""},null,{"$f":"IF(E985=\"\",\"\",VLOOKUP(E985,Treinamentos!$B$13:$G$42,5,0))","v":""},null,null,null,null,null,{"$f":"IF(E985=\"\",\"\",VLOOKUP(E985,Treinamentos!$B$13:$G$42,6,0))","v":""}]
[null,null,{"$f":"IF(B986=\"\",\"\",VLOOKUP(B986,Colab!$C$14:$E$63,2,0))","v":""},{"$f":"IF(B986=\"\",\"\",VLOOKUP(B986,Colab!$C$14:$E$63,3,0))","v":""},null,{"$f":"IF(E986=\"\",\"\",VLOOKUP(E986,Treinamentos!$B$13:$G$42,5,0))","v":""},null,null,null,null,null,{"$f":"IF(E986=\"\",\"\",VLOOKUP(E986,Treinamentos!$B$13:$G$42,6,0))","v":""}]
[null,null,{"$f":"IF(B987=\"\",\"\",VLOOKUP(B987,Colab!$C$14:$E$63,2,0))","v":""},{"$f":"IF(B987=\"\",\"\",VLOOKUP(B987,Colab!$C$14:$E$63,3,0))","v":""},null,{"$f":"IF(E987=\"\",\"\",VLOOKUP(E987,Treinamentos!$B$13:$G$42,5,0))","v":""},null,null,null,null,null,{"$f":"IF(E987=\"\",\"\",VLOOKUP(E987,Treinamentos!$B$13:$G$42,6,0))","v":""}]
[null,null,{"$f":"IF(B988=\"\",\"\",VLOOKUP(B988,Colab!$C$14:$E$63,2,0))","v":""},{"$f":"IF(B988=\"\",\"\",VLOOKUP(B988,Colab!$C$14:$E$63,3,0))","v":""},null,{"$f":"IF(E988=\"\",\"\",VLOOKUP(E988,Treinamentos!$B$13:$G$42,5,0))","v":""},null,null,null,null,null,{"$f":"IF(E988=\"\",\"\",VLOOKUP(E988,Treinamentos!$B$13:$G$42,6,0))","v":""}]
[null,null,{"$f":"IF(B989=\"\",\"\",VLOOKUP(B989,Colab!$C$14:$E$63,2,0))","v":""},{"$f":"IF(B989=\"\",\"\",VLOOKUP(B989,Colab!$C$14:$E$63,3,0))","v":""},null,{"$f":"IF(E989=\"\",\"\",VLOOKUP(E989,Treinamentos!$B$13:$G$42,5,0))","v":""},null,null,null,null,null,{"$f":"IF(E989=\"\",\"\",VLOOKUP(E989,Treinamentos!$B$13:$G$42,6,0))","v":""}]
[null,null,{"$f":"IF(B990=\"\",\"\",VLOOKUP(B990,Colab!$C$14:$E$63,2,0))","v":""},{"$f":"IF(B990=\"\",\"\",VLOOKUP(B990,Colab!$C$14:$E$63,3,0))","v":""},null,{"$f":"IF(E990=\"\",\"\",VLOOKUP(E990,Treinamentos!$B$13:$G$42,5,0))","v":""},null,null,null,null,null,{"$f":"IF(E990=\"\",\"\",VLOOKUP(E990,Treinamentos!$B$13:$G$42,6,0))","v":""}]
[null,null,{"$f":"IF(B991=\"\",\"\",VLOOKUP(B991,Colab!$C$14:$E$63,2,0))","v":""},{"$f":"IF(B991=\"\",\"\",VLOOKUP(B991,Colab!$C$14:$E$63,3,0))","v":""},null,{"$f":"IF(E991=\"\",\"\",VLOOKUP(E991,Treinamentos!$B$13:$G$42,5,0))","v":""},null,null,null,null,null,{"$f":"IF(E991=\"\",\"\",VLOOKUP(E991,Treinamentos!$B$13:$G$42,6,0))","v":""}]
[null,null,{"$f":"IF(B992=\"\",\"\",VLOOKUP(B992,Colab!$C$14:$E$63,2,0))","v":""},{"$f":"IF(B992=\"\",\"\",VLOOKUP(B992,Colab!$C$14:$E$63,3,0))","v":""},null,{"$f":"IF(E992=\"\",\"\",VLOOKUP(E992,Treinamentos!$B$13:$G$42,5,0))","v":""},null,null,null,null,null,{"$f":"IF(E992=\"\",\"\",VLOOKUP(E992,Treinamentos!$B$13:$G$42,6,0))","v":""}]
[null,null,{"$f":"IF(B993=\"\",\"\",VLOOKUP(B993,Colab!$C$14:$E$63,2,0))","v":""},{"$f":"IF(B993=\"\",\"\",VLOOKUP(B993,Colab!$C$14:$E$63,3,0))","v":""},null,{"$f":"IF(E993=\"\",\"\",VLOOKUP(E993,Treinamentos!$B$13:$G$42,5,0))","v":""},null,null,null,null,null,{"$f":"IF(E993=\"\",\"\",VLOOKUP(E993,Treinamentos!$B$13:$G$42,6,0))","v":""}]
[null,null,{"$f":"IF(B994=\"\",\"\",VLOOKUP(B994,Colab!$C$14:$E$63,2,0))","v":""},{"$f":"IF(B994=\"\",\"\",VLOOKUP(B994,Colab!$C$14:$E$63,3,0))","v":""},null,{"$f":"IF(E994=\"\",\"\",VLOOKUP(E994,Treinamentos!$B$13:$G$42,5,0))","v":""},null,null,null,null,null,{"$f":"IF(E994=\"\",\"\",VLOOKUP(E994,Treinamentos!$B$13:$G$42,6,0))","v":""}]
[null,null,{"$f":"IF(B995=\"\",\"\",VLOOKUP(B995,Colab!$C$14:$E$63,2,0))","v":""},{"$f":"IF(B995=\"\",\"\",VLOOKUP(B995,Colab!$C$14:$E$63,3,0))","v":""},null,{"$f":"IF(E995=\"\",\"\",VLOOKUP(E995,Treinamentos!$B$13:$G$42,5,0))","v":""},null,null,null,null,null,{"$f":"IF(E995=\"\",\"\",VLOOKUP(E995,Treinamentos!$B$13:$G$42,6,0))","v":""}]
[null,null,{"$f":"IF(B996=\"\",\"\",VLOOKUP(B996,Colab!$C$14:$E$63,2,0))","v":""},{"$f":"IF(B996=\"\",\"\",VLOOKUP(B996,Colab!$C$14:$E$63,3,0))","v":""},null,{"$f":"IF(E996=\"\",\"\",VLOOKUP(E996,Treinamentos!$B$13:$G$42,5,0))","v":""},null,null,null,null,null,{"$f":"IF(E996=\"\",\"\",VLOOKUP(E996,Treinamentos!$B$13:$G$42,6,0))","v":""}]
[null,null,{"$f":"IF(B997=\"\",\"\",VLOOKUP(B997,Colab!$C$14:$E$63,2,0))","v":""},{"$f":"IF(B997=\"\",\"\",VLOOKUP(B997,Colab!$C$14:$E$63,3,0))","v":""},null,{"$f":"IF(E997=\"\",\"\",VLOOKUP(E997,Treinamentos!$B$13:$G$42,5,0))","v":""},null,null,null,null,null,{"$f":"IF(E997=\"\",\"\",VLOOKUP(E997,Treinamentos!$B$13:$G$42,6,0))","v":""}]
[null,null,{"$f":"IF(B998=\"\",\"\",VLOOKUP(B998,Colab!$C$14:$E$63,2,0))","v":""},{"$f":"IF(B998=\"\",\"\",VLOOKUP(B998,Colab!$C$14:$E$63,3,0))","v":""},null,{"$f":"IF(E998=\"\",\"\",VLOOKUP(E998,Treinamentos!$B$13:$G$42,5,0))","v":""},null,null,null,null,null,{"$f":"IF(E998=\"\",\"\",VLOOKUP(E998,Treinamentos!$B$13:$G$42,6,0))","v":""}]
[null,null,{"$f":"IF(B999=\"\",\"\",VLOOKUP(B999,Colab!$C$14:$E$63,2,0))","v":""},{"$f":"IF(B999=\"\",\"\",VLOOKUP(B999,Colab!$C$14:$E$63,3,0))","v":""},null,{"$f":"IF(E999=\"\",\"\",VLOOKUP(E999,Treinamentos!$B$13:$G$42,5,0))","v":""},null,null,null,null,null,{"$f":"IF(E999=\"\",\"\",VLOOKUP(E999,Treinamentos!$B$13:$G$42,6,0))","v":""}]

{"sheet":"Dash1","index":5,"n_rows":9,"n_cols":4,"rows_kept":9,"cut":false,"hidden":false,"merged":[[8,1,8,2],[8,3,8,8]]}
[]
[]
[]
[]
[]
[]
[]
[]
[null,"Empresa",null,{"$f":"Menu!K14","v":"Empresa ABCDE"}]

{"sheet":"Tab","index":6,"n_rows":4,"n_cols":24,"rows_kept":4,"cut":false,"hidden":false,"merged":[]}
["Soma de Investimento","Rótulos de Coluna",null,null,null,"Status","Concluído",null,null,"Soma de Investimento","Rótulos de Coluna",null,null,"Contagem de Investimento","Rótulos de Coluna",null,null,null,"Contagem de Investimento","Rótulos de Coluna",null,null,"Status","Concluído"]
["Rótulos de Linha","Concluído","Programado",null,null,null,null,null,null,"Rótulos de Linha","Concluído",null,null,"Rótulos de Linha","Concluído","Programado",null,null,"Rótulos de Linha","Concluído"]
["Treinamento 1",1000,null,null,null,"Soma de Investimento",null,null,null,"Administrativo",1000,null,null,"Administrativo",1,null,null,null,"Administrativo",1,null,null,"Contagem de Investimento"]
["Treinamento 2",null,500,null,null,1000,null,null,null,null,null,null,null,"Produção",null,1,null,null,null,null,null,null,1]

{"sheet":"CST","index":7,"n_rows":0,"n_cols":0,"rows_kept":0,"cut":false,"hidden":false,"merged":[]}

{"sheet":"FS","index":8,"n_rows":0,"n_cols":0,"rows_kept":0,"cut":false,"hidden":false,"merged":[]}