{"text_format":"1","workbook":"xlsx","n_sheets":9,"sheets":["Menu","Cad","Colab","Treinamentos","Plano","Dash1","Tab","CST","FS"],"not_rendered":{"charts":4,"images":37,"macros":1,"external_links":3,"defined_names":17,"comments":0,"pivot_tables":6},"unopened":[],"bounds":{"document_bytes":16777216,"sheet_cells":100000,"rows_first":2000,"rows_last":500,"rows_between":2000,"halvings":0,"cell_chars":16384,"cell_head_chars":4096},"cells_cut":0,"cells_raw":0,"read":"whole","date_system":"1900"}

{"sheet":"Menu","index":0,"n_rows":15,"n_cols":11,"rows_kept":15,"cut":false,"hidden":false,"merged":[[13,8,13,9],[13,10,13,15],[14,10,14,15],[14,7,14,9]]}
[]
[]
[]
[]
[]
[]
[]
[]
[]
[]
[]
[]
[]
[null,null,null,null,null,null,null,null,"Empresa",null,"Empresa ABCDE"]
[null,null,null,null,null,null,null,"Segmento da Empresa",null,null,"Comércio"]

{"sheet":"Cad","index":1,"n_rows":33,"n_cols":12,"rows_kept":33,"cut":false,"hidden":false,"merged":[[10,1,10,2],[10,4,10,5],[11,1,12,1],[11,2,12,2],[11,4,12,4],[11,5,12,5]]}
[]
[]
[]
[]
[]
[]
[]
[]
[]
[]
[null,"CADASTRO DE FUNÇÕES\nINSIRA AS FUNÇÕES UTILIZADAS EM SUA EMPRESA",null,null,"CADASTRO DE DEPARTAMENTOS\nINSIRA OS DEPARTAMENTOS UTILIZADOS EM SUA EMPRESA"]
[null,"ITEM","FUNÇÃO",null,"ITEM","DEPARTAMENTO"]
[null,null,null,null,null,null,null,"Programado","Programado",null,"Concluído","Concluído"]
[null,1,"Auxiliar Administrativo",null,1,"Administrativo",null,{"$f":"COUNTIFS(Plano!$C$13:$C$300,F14,Plano!$M$13:$M$300,$H$13)","v":0},{"$f":"SUMIFS(Plano!$L$13:$L$300,Plano!$C$13:$C$300,C14,Plano!$M$13:$M$300,$I$13)","v":0},null,{"$f":"COUNTIFS(Plano!$C$13:$C$300,F14,Plano!$M$13:$M$300,$K$13)","v":1},{"$f":"SUMIFS(Plano!$L$13:$L$300,Plano!$C$13:$C$300,F14,Plano!$M$13:$M$300,$L$13)","v":2000}]
[null,2,"Analista Administrativo",null,2,"Produção",null,{"$f":"COUNTIFS(Plano!$C$13:$C$300,F15,Plano!$M$13:$M$300,$H$13)","v":1},{"$f":"SUMIFS(Plano!$L$13:$L$300,Plano!$C$13:$C$300,C15,Plano!$M$13:$M$300,$I$13)","v":0},null,{"$f":"COUNTIFS(Plano!$C$13:$C$300,F15,Plano!$M$13:$M$300,$K$13)","v":0},{"$f":"SUMIFS(Plano!$L$13:$L$300,Plano!$C$13:$C$300,F15,Plano!$M$13:$M$300,$L$13)","v":0}]
[null,3,"Recepcionista",null,3,null,null,{"$f":"COUNTIFS(Plano!$C$13:$C$300,F16,Plano!$M$13:$M$300,$H$13)","v":0},{"$f":"SUMIFS(Plano!$L$13:$L$300,Plano!$C$13:$C$300,C16,Plano!$M$13:$M$300,$I$13)","v":0},null,{"$f":"COUNTIFS(Plano!$C$13:$C$300,F16,Plano!$M$13:$M$300,$K$13)","v":0},{"$f":"SUMIFS(Plano!$L$13:$L$300,Plano!$C$13:$C$300,F16,Plano!$M$13:$M$300,$L$13)","v":0}]
[null,4,"Gerente Geral",null,4,null,null,{"$f":"COUNTIFS(Plano!$C$13:$C$300,F17,Plano!$M$13:$M$300,$H$13)","v":0},{"$f":"SUMIFS(Plano!$L$13:$L$300,Plano!$C$13:$C$300,C17,Plano!$M$13:$M$300,$I$13)","v":0},null,{"$f":"COUNTIFS(Plano!$C$13:$C$300,F17,Plano!$M$13:$M$300,$K$13)","v":0},{"$f":"SUMIFS(Plano!$L$13:$L$300,Plano!$C$13:$C$300,F17,Plano!$M$13:$M$300,$L$13)","v":0}]
[null,5,"Auxiliar de Produção",null,5,null,null,{"$f":"COUNTIFS(Plano!$C$13:$C$300,F18,Plano!$M$13:$M$300,$H$13)","v":0},{"$f":"SUMIFS(Plano!$L$13:$L$300,Plano!$C$13:$C$300,C18,Plano!$M$13:$M$300,$I$13)","v":0},null,{"$f":"COUNTIFS(Plano!$C$13:$C$300,F18,Plano!$M$13:$M$300,$K$13)","v":0},{"$f":"SUMIFS(Plano!$L$13:$L$300,Plano!$C$13:$C$300,F18,Plano!$M$13:$M$300,$L$13)","v":0}]
[null,6,null,null,6,null,null,{"$f":"COUNTIFS(Plano!$C$13:$C$300,F19,Plano!$M$13:$M$300,$H$13)","v":0},{"$f":"SUMIFS(Plano!$L$13:$L$300,Plano!$C$13:$C$300,C19,Plano!$M$13:$M$300,$I$13)","v":0},null,{"$f":"COUNTIFS(Plano!$C$13:$C$300,F19,Plano!$M$13:$M$300,$K$13)","v":0},{"$f":"SUMIFS(Plano!$L$13:$L$300,Plano!$C$13:$C$300,F19,Plano!$M$13:$M$300,$L$13)","v":0}]
[null,7,null,null,7,null,null,{"$f":"COUNTIFS(Plano!$C$13:$C$300,F20,Plano!$M$13:$M$300,$H$13)","v":0},{"$f":"SUMIFS(Plano!$L$13:$L$300,Plano!$C$13:$C$300,C20,Plano!$M$13:$M$300,$I$13)","v":0},null,{"$f":"COUNTIFS(Plano!$C$13:$C$300,F20,Plano!$M$13:$M$300,$K$13)","v":0},{"$f":"SUMIFS(Plano!$L$13:$L$300,Plano!$C$13:$C$300,F20,Plano!$M$13:$M$300,$L$13)","v":0}]
{"$rows_left_out":14}
{"sheet":"Colab","index":2,"n_rows":63,"n_cols":15,"rows_kept":63,"cut":false,"hidden":false,"merged":[[9,3,9,4],[11,2,11,4]]}
[]
[]
[]
[]
[]
[]
[]
[]
[]
[]
[]
[null,null,"CADASTRO DE COLABORADORES\nINSIRA OS DADOS DOS SEUS COLABORADORES"]
[null,null,"COLABORADOR","DEPARTAMENTO","FUNÇÃO",null,null,null,null,null,"Programado","Programado",null,"Concluído","Concluído"]
[null,null,"José da Silva","Administrativo","Assistente Administrativo",null,null,null,null,null,{"$f":"COUNTIFS(Plano!$B$13:$B$999,C14,Plano!$M$13:$M$999,$K$13)","v":0},{"$f":"SUMIFS(Plano!$L$13:$L$999,Plano!$B$13:$B$999,C14,Plano!$M$13:$M$999,$L$13)","v":0},null,{"$f":"COUNTIFS(Plano!$B$13:$B$999,C14,Plano!$M$13:$M$999,$N$13)","v":1},{"$f":"SUMIFS(Plano!$L$13:$L$999,Plano!$B$13:$B$999,C14,Plano!$M$13:$M$999,$O$13)","v":2000}]
[null,null,"João Alves","Produção","Auxiliar de Produção",null,null,null,null,null,{"$f":"COUNTIFS(Plano!$B$13:$B$999,C15,Plano!$M$13:$M$999,$K$13)","v":1},{"$f":"SUMIFS(Plano!$L$13:$L$999,Plano!$B$13:$B$999,C15,Plano!$M$13:$M$999,$L$13)","v":500},null,{"$f":"COUNTIFS(Plano!$B$13:$B$999,C15,Plano!$M$13:$M$999,$N$13)","v":0},{"$f":"SUMIFS(Plano!$L$13:$L$999,Plano!$B$13:$B$999,C15,Plano!$M$13:$M$999,$O$13)","v":0}]
[null,null,"Paulo Vitor","Administrativo","Analista Administrativo",null,null,null,null,null,{"$f":"COUNTIFS(Plano!$B$13:$B$999,C16,Plano!$M$13:$M$999,$K$13)","v":0},{"$f":"SUMIFS(Plano!$L$13:$L$999,Plano!$B$13:$B$999,C16,Plano!$M$13:$M$999,$L$13)","v":0},null,{"$f":"COUNTIFS(Plano!$B$13:$B$999,C16,Plano!$M$13:$M$999,$N$13)","v":0},{"$f":"SUMIFS(Plano!$L$13:$L$999,Plano!$B$13:$B$999,C16,Plano!$M$13:$M$999,$O$13)","v":0}]
[null,null,null,null,null,null,null,null,null,null,{"$f":"COUNTIFS(Plano!$B$13:$B$999,C17,Plano!$M$13:$M$999,$K$13)","v":0},{"$f":"SUMIFS(Plano!$L$13:$L$999,Plano!$B$13:$B$999,C17,Plano!$M$13:$M$999,$L$13)","v":0},null,{"$f":"COUNTIFS(Plano!$B$13:$B$999,C17,Plano!$M$13:$M$999,$N$13)","v":0},{"$f":"SUMIFS(Plano!$L$13:$L$999,Plano!$B$13:$B$999,C17,Plano!$M$13:$M$999,$O$13)","v":0}]
[null,null,null,null,null,null,null,null,null,null,{"$f":"COUNTIFS(Plano!$B$13:$B$999,C18,Plano!$M$13:$M$999,$K$13)","v":0},{"$f":"SUMIFS(Plano!$L$13:$L$999,Plano!$B$13:$B$999,C18,Plano!$M$13:$M$999,$L$13)","v":0},null,{"$f":"COUNTIFS(Plano!$B$13:$B$999,C18,Plano!$M$13:$M$999,$N$13)","v":0},{"$f":"SUMIFS(Plano!$L$13:$L$999,Plano!$B$13:$B$999,C18,Plano!$M$13:$M$999,$O$13)","v":0}]
[null,null,null,null,null,null,null,null,null,null,{"$f":"COUNTIFS(Plano!$B$13:$B$999,C19,Plano!$M$13:$M$999,$K$13)","v":0},{"$f":"SUMIFS(Plano!$L$13:$L$999,Plano!$B$13:$B$999,C19,Plano!$M$13:$M$999,$L$13)","v":0},null,{"$f":"COUNTIFS(Plano!$B$13:$B$999,C19,Plano!$M$13:$M$999,$N$13)","v":0},{"$f":"SUMIFS(Plano!$L$13:$L$999,Plano!$B$13:$B$999,C19,Plano!$M$13:$M$999,$O$13)","v":0}]
[null,null,null,null,null,null,null,null,null,null,{"$f":"COUNTIFS(Plano!$B$13:$B$999,C20,Plano!$M$13:$M$999,$K$13)","v":0},{"$f":"SUMIFS(Plano!$L$13:$L$999,Plano!$B$13:$B$999,C20,Plano!$M$13:$M$999,$L$13)","v":0},null,{"$f":"COUNTIFS(Plano!$B$13:$B$999,C20,Plano!$M$13:$M$999,$N$13)","v":0},{"$f":"SUMIFS(Plano!$L$13:$L$999,Plano!$B$13:$B$999,C20,Plano!$M$13:$M$999,$O$13)","v":0}]
{"$rows_left_out":44}
{"sheet":"Treinamentos","index":3,"n_rows":42,"n_cols":14,"rows_kept":42,"cut":false,"hidden":false,"merged":[[10,1,10,6]]}
[]
[]
[]
[]
[]
[]
[]
[]
[]
[]
[null,"CADASTRO DE TREINAMENTOS\nINSIRA OS TREINAMENTOS NECESSÁRIOS PARA SUA EMPRESA"]
[null,"TREINAMENTOS","NOME CAPACITAÇÃO","DESCRITIVO CAPACITAÇÃO","EMPRESA RESPONSÁVEL","CARGA HORÁRIA","VALOR POR ALUNO",null,null,"Programado","Programado",null,"Concluído","Concluído"]
[null,"Treinamento 1",null,null,null,"8 horas",2000,null,null,{"$f":"COUNTIFS([3]Plano!$E$14:$E$1000,[3]Treinamentos!B13,[3]Plano!$M$14:$M$1000,[3]Treinamentos!$M$13)","v":{"$error":"#VALUE!"}},{"$f":"SUMIFS([3]Plano!$L$14:$L$1000,[3]Plano!$E$14:$E$1000,[3]Treinamentos!B13,[3]Plano!$M$14:$M$1000,[3]Treinamentos!$N$13)","v":{"$error":"#VALUE!"}},null,{"$f":"COUNTIFS([3]Plano!$E$14:$E$1000,[3]Treinamentos!B13,[3]Plano!$M$14:$M$1000,[3]Treinamentos!$P$13)","v":{"$error":"#VALUE!"}},{"$f":"SUMIFS([3]Plano!$L$14:$L$1000,[3]Plano!$E$14:$E$1000,[3]Treinamentos!B13,[3]Plano!$M$14:$M$1000,[3]Treinamentos!$Q$13)","v":{"$error":"#VALUE!"}}]
[null,"Treinamento 2",null,null,null,"4 horas",500,null,null,{"$f":"COUNTIF([3]Plano!$E$14:$E$1000,[3]Treinamentos!B14)","v":{"$error":"#VALUE!"}},{"$f":"SUMIFS([3]Plano!$L$14:$L$1000,[3]Plano!$E$14:$E$1000,[3]Treinamentos!B14,[3]Plano!$M$14:$M$1000,[3]Treinamentos!$N$13)","v":{"$error":"#VALUE!"}},null,{"$f":"COUNTIFS([3]Plano!$E$14:$E$1000,[3]Treinamentos!B14,[3]Plano!$M$14:$M$1000,[3]Treinamentos!$P$13)","v":{"$error":"#VALUE!"}},{"$f":"SUMIFS([3]Plano!$L$14:$L$1000,[3]Plano!$E$14:$E$1000,[3]Treinamentos!B14,[3]Plano!$M$14:$M$1000,[3]Treinamentos!$Q$13)","v":{"$error":"#VALUE!"}}]
[null,"Treinamento 3",null,null,null,"2 horas",300,null,null,{"$f":"COUNTIF([3]Plano!$E$14:$E$1000,[3]Treinamentos!B15)","v":{"$error":"#VALUE!"}},{"$f":"SUMIFS([3]Plano!$L$14:$L$1000,[3]Plano!$E$14:$E$1000,[3]Treinamentos!B15,[3]Plano!$M$14:$M$1000,[3]Treinamentos!$N$13)","v":{"$error":"#VALUE!"}},null,{"$f":"COUNTIFS([3]Plano!$E$14:$E$1000,[3]Treinamentos!B15,[3]Plano!$M$14:$M$1000,[3]Treinamentos!$P$13)","v":{"$error":"#VALUE!"}},{"$f":"SUMIFS([3]Plano!$L$14:$L$1000,[3]Plano!$E$14:$E$1000,[3]Treinamentos!B15,[3]Plano!$M$14:$M$1000,[3]Treinamentos!$Q$13)","v":{"$error":"#VALUE!"}}]
[null,"Treinamento 4",null,null,null,"2 horas",300,null,null,{"$f":"COUNTIF([3]Plano!$E$14:$E$1000,[3]Treinamentos!B16)","v":{"$error":"#VALUE!"}},{"$f":"SUMIFS([3]Plano!$L$14:$L$1000,[3]Plano!$E$14:$E$1000,[3]Treinamentos!B16,[3]Plano!$M$14:$M$1000,[3]Treinamentos!$N$13)","v":{"$error":"#VALUE!"}},null,{"$f":"COUNTIFS([3]Plano!$E$14:$E$1000,[3]Treinamentos!B16,[3]Plano!$M$14:$M$1000,[3]Treinamentos!$P$13)","v":{"$error":"#VALUE!"}},{"$f":"SUMIFS([3]Plano!$L$14:$L$1000,[3]Plano!$E$14:$E$1000,[3]Treinamentos!B16,[3]Plano!$M$14:$M$1000,[3]Treinamentos!$Q$13)","v":{"$error":"#VALUE!"}}]
[null,"Treinamento 5",null,null,null,"2 horas",300,null,null,{"$f":"COUNTIF([3]Plano!$E$14:$E$1000,[3]Treinamentos!B17)","v":{"$error":"#VALUE!"}},{"$f":"SUMIFS([3]Plano!$L$14:$L$1000,[3]Plano!$E$14:$E$1000,[3]Treinamentos!B17,[3]Plano!$M$14:$M$1000,[3]Treinamentos!$N$13)","v":{"$error":"#VALUE!"}},null,{"$f":"COUNTIFS([3]Plano!$E$14:$E$1000,[3]Treinamentos!B17,[3]Plano!$M$14:$M$1000,[3]Treinamentos!$P$13)","v":{"$error":"#VALUE!"}},{"$f":"SUMIFS([3]Plano!$L$14:$L$1000,[3]Plano!$E$14:$E$1000,[3]Treinamentos!B17,[3]Plano!$M$14:$M$1000,[3]Treinamentos!$Q$13)","v":{"$error":"#VALUE!"}}]
[null,"Treinamento 6",null,null,null,"2 horas",300,null,null,{"$f":"COUNTIF([3]Plano!$E$14:$E$1000,[3]Treinamentos!B18)","v":{"$error":"#VALUE!"}},{"$f":"SUMIFS([3]Plano!$L$14:$L$1000,[3]Plano!$E$14:$E$1000,[3]Treinamentos!B18,[3]Plano!$M$14:$M$1000,[3]Treinamentos!$N$13)","v":{"$error":"#VALUE!"}},null,{"$f":"COUNTIFS([3]Plano!$E$14:$E$1000,[3]Treinamentos!B18,[3]Plano!$M$14:$M$1000,[3]Treinamentos!$P$13)","v":{"$error":"#VALUE!"}},{"$f":"SUMIFS([3]Plano!$L$14:$L$1000,[3]Plano!$E$14:$E$1000,[3]Treinamentos!B18,[3]Plano!$M$14:$M$1000,[3]Treinamentos!$Q$13)","v":{"$error":"#VALUE!"}}]
[null,"Treinamento 7",null,null,null,"2 horas",300,null,null,{"$f":"COUNTIF([3]Plano!$E$14:$E$1000,[3]Treinamentos!B19)","v":{"$error":"#VALUE!"}},{"$f":"SUMIFS([3]Plano!$L$14:$L$1000,[3]Plano!$E$14:$E$1000,[3]Treinamentos!B19,[3]Plano!$M$14:$M$1000,[3]Treinamentos!$N$13)","v":{"$error":"#VALUE!"}},null,{"$f":"COUNTIFS([3]Plano!$E$14:$E$1000,[3]Treinamentos!B19,[3]Plano!$M$14:$M$1000,[3]Treinamentos!$P$13)","v":{"$error":"#VALUE!"}},{"$f":"SUMIFS([3]Plano!$L$14:$L$1000,[3]Plano!$E$14:$E$1000,[3]Treinamentos!B19,[3]Plano!$M$14:$M$1000,[3]Treinamentos!$Q$13)","v":{"$error":"#VALUE!"}}]
[null,"Treinamento 8",null,null,null,"2 horas",300,null,null,{"$f":"COUNTIF([3]Plano!$E$14:$E$1000,[3]Treinamentos!B20)","v":{"$error":"#VALUE!"}},{"$f":"SUMIFS([3]Plano!$L$14:$L$1000,[3]Plano!$E$14:$E$1000,[3]Treinamentos!B20,[3]Plano!$M$14:$M$1000,[3]Treinamentos!$N$13)","v":{"$error":"#VALUE!"}},null,{"$f":"COUNTIFS([3]Plano!$E$14:$E$1000,[3]Treinamentos!B20,[3]Plano!$M$14:$M$1000,[3]Treinamentos!$P$13)","v":{"$error":"#VALUE!"}},{"$f":"SUMIFS([3]Plano!$L$14:$L$1000,[3]Plano!$E$14:$E$1000,[3]Treinamentos!B20,[3]Plano!$M$14:$M$1000,[3]Treinamentos!$Q$13)","v":{"$error":"#VALUE!"}}]
{"$rows_left_out":23}
{"sheet":"Plano","index":4,"n_rows":999,"n_cols":17,"rows_kept":999,"cut":false,"hidden":false,"merged":[[10,1,10,12]]}
[]
[]
[]
[]
[]
[]
[]
[]
[]
[]
[null,"PLANEJAMENTO DE TREINAMENTOS\nINSIRA OS TREINAMENTOS PREVISTOS E ACOMPANHE OS TREINAMENTOS"]
[null,"COLABORADOR","ÁREA","CARGO","TREINAMENTO","CARGA HORÁRIA","OBJETIVO","MOTIVO TREINAMENTO","DATA INÍCIO","DATA TÉRMINO","CERTIFICADO ENTREGUE","INVESTIMENTO","STATUS",null,null,null,"Média"]
[null,"José da Silva",{"$f":"IF(B13=\"\",\"\",VLOOKUP(B13,Colab!$C$14:$E$63,2,0))","v":"Administrativo"},{"$f":"IF(B13=\"\",\"\",VLOOKUP(B13,Colab!$C$14:$E$63,3,0))","v":"Assistente Administrativo"},"Treinamento 1",{"$f":"IF(E13=\"\",\"\",VLOOKUP(E13,Treinamentos!$B$13:$G$42,5,0))","v":"8 horas"},null,null,null,null,"Sim",{"$f":"IF(E13=\"\",\"\",VLOOKUP(E13,Treinamentos!$B$13:$G$42,6,0))","v":2000},"Concluído",null,null,null,{"$f":"IFERROR(AVERAGEIF(C13:M13,\">0\"),\"\")","v":2000}]
[null,"João Alves",{"$f":"IF(B14=\"\",\"\",VLOOKUP(B14,Colab!$C$14:$E$63,2,0))","v":"Produção"},{"$f":"IF(B14=\"\",\"\",VLOOKUP(B14,Colab!$C$14:$E$63,3,0))","v":"Auxiliar de Produção"},"Treinamento 2",{"$f":"IF(E14=\"\",\"\",VLOOKUP(E14,Treinamentos!$B$13:$G$42,5,0))","v":"4 horas"},null,null,null,null,null,{"$f":"IF(E14=\"\",\"\",VLOOKUP(E14,Treinamentos!$B$13:$G$42,6,0))","v":500},"Programado",null,null,null,500]
[null,"João Alves",{"$f":"IF(B15=\"\",\"\",VLOOKUP(B15,Colab!$C$14:$E$63,2,0))","v":"Produção"},{"$f":"IF(B15=\"\",\"\",VLOOKUP(B15,Colab!$C$14:$E$63,3,0))","v":"Auxiliar de Produção"},"Treinamento 3",{"$f":"IF(E15=\"\",\"\",VLOOKUP(E15,Treinamentos!$B$13:$G$42,5,0))","v":"2 horas"},null,null,null,null,null,{"$f":"IF(E15=\"\",\"\",VLOOKUP(E15,Treinamentos!$B$13:$G$42,6,0))","v":300},"Cancelado",null,null,null,300]
[null,null,{"$f":"IF(B16=\"\",\"\",VLOOKUP(B16,Colab!$C$14:$E$63,2,0))","v":""},{"$f":"IF(B16=\"\",\"\",VLOOKUP(B16,Colab!$C$14:$E$63,3,0))","v":""},null,{"$f":"IF(E16=\"\",\"\",VLOOKUP(E16,Treinamentos!$B$13:$G$42,5,0))","v":""},null,null,null,null,null,{"$f":"IF(E16=\"\",\"\",VLOOKUP(E16,Treinamentos!$B$13:$G$42,6,0))","v":""},null,null,null,null,""]
[null,null,{"$f":"IF(B17=\"\",\"\",VLOOKUP(B17,Colab!$C$14:$E$63,2,0))","v":""},{"$f":"IF(B17=\"\",\"\",VLOOKUP(B17,Colab!$C$14:$E$63,3,0))","v":""},null,{"$f":"IF(E17=\"\",\"\",VLOOKUP(E17,Treinamentos!$B$13:$G$42,5,0))","v":""},null,null,null,null,null,{"$f":"IF(E17=\"\",\"\",VLOOKUP(E17,Treinamentos!$B$13:$G$42,6,0))","v":""},null,null,null,null,""]
[null,null,{"$f":"IF(B18=\"\",\"\",VLOOKUP(B18,Colab!$C$14:$E$63,2,0))","v":""},{"$f":"IF(B18=\"\",\"\",VLOOKUP(B18,Colab!$C$14:$E$63,3,0))","v":""},null,{"$f":"IF(E18=\"\",\"\",VLOOKUP(E18,Treinamentos!$B$13:$G$42,5,0))","v":""},null,null,null,null,null,{"$f":"IF(E18=\"\",\"\",VLOOKUP(E18,Treinamentos!$B$13:$G$42,6,0))","v":""},null,null,null,null,""]
[null,null,{"$f":"IF(B19=\"\",\"\",VLOOKUP(B19,Colab!$C$14:$E$63,2,0))","v":""},{"$f":"IF(B19=\"\",\"\",VLOOKUP(B19,Colab!$C$14:$E$63,3,0))","v":""},null,{"$f":"IF(E19=\"\",\"\",VLOOKUP(E19,Treinamentos!$B$13:$G$42,5,0))","v":""},null,null,null,null,null,{"$f":"IF(E19=\"\",\"\",VLOOKUP(E19,Treinamentos!$B$13:$G$42,6,0))","v":""},null,null,null,null,""]
[null,null,{"$f":"IF(B20=\"\",\"\",VLOOKUP(B20,Colab!$C$14:$E$63,2,0))","v":""},{"$f":"IF(B20=\"\",\"\",VLOOKUP(B20,Colab!$C$14:$E$63,3,0))","v":""},null,{"$f":"IF(E20=\"\",\"\",VLOOKUP(E20,Treinamentos!$B$13:$G$42,5,0))","v":""},null,null,null,null,null,{"$f":"IF(E20=\"\",\"\",VLOOKUP(E20,Treinamentos!$B$13:$G$42,6,0))","v":""},null,null,null,null,""]
{"$rows_left_out":980}
{"sheet":"Dash1","index":5,"n_rows":9,"n_cols":4,"rows_kept":9,"cut":false,"hidden":false,"merged":[[8,1,8,2],[8,3,8,8]]}
[]
[]
[]
[]
[]
[]
[]
[]
[null,"Empresa",null,{"$f":"Menu!K14","v":"Empresa ABCDE"}]

{"sheet":"Tab","index":6,"n_rows":4,"n_cols":24,"rows_kept":4,"cut":false,"hidden":false,"merged":[]}
["Soma de Investimento","Rótulos de Coluna",null,null,null,"Status","Concluído",null,null,"Soma de Investimento","Rótulos de Coluna",null,null,"Contagem de Investimento","Rótulos de Coluna",null,null,null,"Contagem de Investimento","Rótulos de Coluna",null,null,"Status","Concluído"]
["Rótulos de Linha","Concluído","Programado",null,null,null,null,null,null,"Rótulos de Linha","Concluído",null,null,"Rótulos de Linha","Concluído","Programado",null,null,"Rótulos de Linha","Concluído"]
["Treinamento 1",1000,null,null,null,"Soma de Investimento",null,null,null,"Administrativo",1000,null,null,"Administrativo",1,null,null,null,"Administrativo",1,null,null,"Contagem de Investimento"]
["Treinamento 2",null,500,null,null,1000,null,null,null,null,null,null,null,"Produção",null,1,null,null,null,null,null,null,1]

{"sheet":"CST","index":7,"n_rows":0,"n_cols":0,"rows_kept":0,"cut":false,"hidden":false,"merged":[]}

{"sheet":"FS","index":8,"n_rows":0,"n_cols":0,"rows_kept":0,"cut":false,"hidden":false,"merged":[]}